Peptide,PTM,ModifiedAA,ModifiedPosition,PeptideUniqueToGene,ExperimentDesc,ExpID,PubmedID,ScoreType,IdentScore,LocProb,Log2FChange,PQ-val,QuantSig,PEP,MassErrorPPM
DTDEEDILLTGINSYR,nt,D,25,true,"Arg/N-end rule pathway Roots",80,25728785,"MASCOT Score",95.3500000,,,,,2.5519999446999E-9,
DTDEEDILLTGINSYR,nt,D,25,true,"Tic56 chloroplast import - ppi2",89b,25588737,XCorr,4.4293308,,,,,,
DTDEEDILLTGINSYR,nt,D,25,true,"Tic56 chloroplast import - tic56-1",89c,25588737,XCorr,3.6876311,,,,,,
DTDEEDILLTGINSYR,nt,D,25,true,"Stromal N-terminome",96,26371235,"MASCOT Score",100.7800000,,,,,,
DTDEEDILLTGINSYR,nt,D,25,true,"FtsH12 N-terminome: WT / FtsH12 knockdown miRNA",118,33216923,"MaxQuant score",98.0400000,,,,,1.8499999412912E-21,
DTDEEDILLTGINSYR,nt,D,25,true,"HUNTER N-terminome: legumain, GluC and trypsin",119,31951383,"MaxQuant score",162.3200000,,,,,,
TTQNLTILSKNENAECLADEIADQFK,ng,N,44,true,"Conserved N-glycosylation",74,22633491,"MaxQuant Score",302.1100000,1.0000000,,,,0,0.3250000
TTQNLTILSK,ng,N,44,true,"N-linked Glycan Micro-heterogeneity Arabidopsis",134,29237727,,,,,,,,
TTQNLTILSK,ng,N,44,true,"UDP-GlcNAc transporter glycopeptide analysis",135,30224661,,,,,,,2.7386012294711E-12,0.7000000
NKPCTNDTGSATVPGTEPQFANYPQILAK,ng,N,72,true,"Conserved N-glycosylation",74,22633491,"MaxQuant Score",158.1300000,0.9840000,,,,4.6059979873125E-40,0.4240000
NKPCTNDTGSATVPGTEPQFANYPQILAK,ng,N,72,true,"N-linked Glycan Micro-heterogeneity Arabidopsis",134,29237727,,,,,,,,
NKPCTNDTGSATVPGTEPQFANYPQILAK,ng,N,72,true,"UDP-GlcNAc transporter glycopeptide analysis",135,30224661,,,,,,,2.7926559803944E-16,1.0000000
CHLNVSDTR,ng,N,99,true,"Conserved N-glycosylation",74,22633491,"MaxQuant Score",199.4000000,1.0000000,,,,9.3259995992412E-6,-0.2330000
CHLNVSDTR,ng,N,99,true,"N-linked Glycan Micro-heterogeneity Arabidopsis",134,29237727,,,,,,,,
CHLNVSDTR,ng,N,99,true,"UDP-GlcNAc transporter glycopeptide analysis",135,30224661,,,,,,,2.6023244572571E-6,0.6000000
DGSIMPACVPR,sno,C,112,true,"hot5-4 / wildtype, FAT-switch S-nitrosoproteome",169,37277371,,,,,,,,
LESNLVLTNFTK,ng,N,124,true,"Conserved N-glycosylation",74,22633491,"MaxQuant Score",157.5700000,1.0000000,,,,4.7650000575191E-17,-0.8900000
LESNLVLTNFTK,ng,N,124,true,"N-glycan occupancy Arabidopsis glycoproteins",87,23994444,"Ladder score",76.8000000,,,,,,
LESNLVLTNFTK,ng,N,124,true,"N-linked Glycan Micro-heterogeneity Arabidopsis",134,29237727,,,,,,,,
LESNLVLTNFTK,ng,N,124,true,"UDP-GlcNAc transporter glycopeptide analysis",135,30224661,,,,,,,4.2889386229279E-15,0.5000000
SQYSMSLNDSK,ng,N,135,true,"Conserved N-glycosylation",74,22633491,"MaxQuant Score",78.0450000,1.0000000,,,,0.0020000000949949,0.2920000
SQYSMSLNDSK,ng,N,135,true,"N-linked Glycan Micro-heterogeneity Arabidopsis",134,29237727,,,,,,,,
SQYSMSLNDSK,ng,N,135,true,"UDP-GlcNAc transporter glycopeptide analysis",135,30224661,,,,,,,2.3989854526008E-5,0.9000000
