Peptide,PTM,ModifiedAA,ModifiedPosition,PeptideUniqueToGene,ExperimentDesc,ExpID,PubmedID,ScoreType,IdentScore,LocProb,Log2FChange,PQ-val,QuantSig,PEP,MassErrorPPM
RSLVFRSSLAGDDGTSGGGLSGFVGK,ph,T,24,true,"Large-scale phosphorylation discovery",44,23111157,XCorr,2.6460000,,,,,,
QVLIAPSSASKEKTQGHIR,ub,K,108,true,"Arabidopsis ubiquitination by TUBEs",2,23667124,,,,,,,,
QVLIAPSSASKEKTQGHIR,ub,K,108,true,"MudPIT plant ubiquitination",103,17272265,XCorr,2.8800000,,,,,,
QVLIAPSSASKEKTQGHIR,ub,K,110,true,"Arabidopsis ubiquitination by TUBEs",2,23667124,,,,,,,,
QVLIAPSSASKEKTQGHIR,ub,K,110,true,"MudPIT plant ubiquitination",103,17272265,XCorr,2.6700000,,,,,,
SSINSLIR,ph,S,365,true,"Tissue atlas Arabidopsis - ProteomicsDB",114,32188942,"MaxQuant score",127.7600000,1.0000000,,,,0.002953140065074,
DVCELGSLR,ph,S,383,true,"Tissue atlas Arabidopsis - ProteomicsDB",114,32188942,"MaxQuant score",115.0000000,1.0000000,,,,0.00040327198803425,
RLSAISDAMPSPLK,ph,S,567,true,"Tissue atlas Arabidopsis - ProteomicsDB",114,32188942,"MaxQuant score",133.8600000,0.9998440,,,,2.0178800696158E-5,
LSAISDAMPSPLK,ph,S,575,true,"Tissue atlas Arabidopsis - ProteomicsDB",114,32188942,"MaxQuant score",144.2900000,0.9999510,,,,1.426299945706E-6,
