Peptide,PTM,ModifiedAA,ModifiedPosition,PeptideUniqueToGene,ExperimentDesc,ExpID,PubmedID,ScoreType,IdentScore,LocProb,Log2FChange,PQ-val,QuantSig,PEP,MassErrorPPM
DSESDLSELDAPR,ph,S,335,true,"Tissue atlas Arabidopsis - ProteomicsDB",114,32188942,"MaxQuant score",55.8990000,0.7744940,,,,0.013881199993193,
DSESDLSELDAPR,ph,S,337,true,"Tissue atlas Arabidopsis - ProteomicsDB",114,32188942,"MaxQuant score",200.0500000,0.9999970,,,,3.8698900913251E-31,
DSESDLSELDAPR,ph,S,340,true,"Tissue atlas Arabidopsis - ProteomicsDB",114,32188942,"MaxQuant score",277.3100000,1.0000000,,,,0,
AVESGEDLSK,ph,S,988,true,"STN8 phosphoproteome",38,21768351,"MASCOT Score",54.4100000,,,,,,0.3878330
AVESGEDLSK,ph,S,988,true,"atm and atr DNA damage response",88,25561503,"MASCOT Score",52.0000000,1.0000000,,,,,-1.2900000
AVESGEDLSK,ph,S,988,true,"Tissue atlas Arabidopsis - ProteomicsDB",114,32188942,"MaxQuant score",117.2100000,0.9999990,,,,0.00017339699843433,
QRVDKSEEEEEEGEEENDGK,ph,S,1053,true,"SnRK2 protein kinase substrates",85,23776212,XCorr,2.8214922,1.0000000,,,,0.0024401100818068,
QRVDKSEEEEEEGEEENDGK,ph,S,1053,true,"Brassinosteroid-Regulated Phosphorylation Dynamics",94,26187819,"MaxQuant Score",105.9900000,1.0000000,,,,0.003000000026077,1.0840000
QRVDKSEEEEEEGEEENDGK,ph,S,1053,true,"TOR Kinase and ABA Receptor",100,29290610,XCorr,3.4019270,1.0000000,,,,0.10710000246763,
QRVDKSEEEEEEGEEENDGK,ph,S,1053,true,"Phospho cell culture sucrose/TOR",109,30833711,,,1.0000000,,,,,
VDKSEEEEEEGEEENDGK,ph,S,1053,true,"STN8 phosphoproteome",38,21768351,"MASCOT Score",42.5800000,,,,,,-1.6085100
VDKSEEEEEEGEEENDGK,ph,S,1053,true,"Large-scale phosphorylation discovery",44,23111157,XCorr,4.9390000,,,,,,
VDKSEEEEEEGEEENDGK,ph,S,1053,true,"SnRK2 protein kinase substrates",85,23776212,XCorr,4.5468011,1.0000000,,,,0.00086739601101726,
VDKSEEEEEEGEEENDGK,ph,S,1053,true,"TOR Kinase and ABA Receptor",100,29290610,XCorr,2.6438165,1.0000000,,,,0.0058550001122057,
VDKSEEEEEEGEEENDGK,ph,S,1053,true,"Tissue atlas Arabidopsis - ProteomicsDB",114,32188942,"MaxQuant score",338.8400000,1.0000000,,,,0,
SRYSFTCSSSDSR,ph,S,1083,true,"Tissue atlas Arabidopsis - ProteomicsDB",114,32188942,"MaxQuant score",101.0100000,0.9933860,,,,0.00010144899715669,
AQSSNGSRRK,ph,S,1095,true,"TOR Kinase and ABA Receptor",100,29290610,XCorr,2.8642609,1.0000000,,,,0.023399999365211,
AQSSNGSRRK,ph,S,1096,true,"TOR Kinase and ABA Receptor",100,29290610,XCorr,2.8642609,1.0000000,,,,0.023399999365211,
