Peptide,PTM,ModifiedAA,ModifiedPosition,PeptideUniqueToGene,ExperimentDesc,ExpID,PubmedID,ScoreType,IdentScore,LocProb,Log2FChange,PQ-val,QuantSig,PEP,MassErrorPPM
FTNETSPR,ph,T,18,true,"Tissue atlas Arabidopsis - ProteomicsDB",114,32188942,"MaxQuant score",142.3600000,0.8070280,,,,0.0058990297839046,
RFTNETSPRK,ph,S,19,true,"TOR Kinase and ABA Receptor",100,29290610,XCorr,2.0975657,0.9882000,,,,0.010379999876022,
FTNETSPR,ph,S,19,true,"Tissue atlas Arabidopsis - ProteomicsDB",114,32188942,"MaxQuant score",184.7100000,0.8860570,,,,7.2363800427411E-6,
DDREGSTPPNKR,ph,S,199,true,"atm and atr DNA damage response",88,25561503,"MASCOT Score",22.0000000,0.9930000,,,,,1.7100000
VSESPNRR,ph,S,239,true,"atm and atr DNA damage response",88,25561503,"MASCOT Score",29.0000000,0.9130000,,,,,-0.5300000
TELSDSSPIK,ph,S,247,true,"Tissue atlas Arabidopsis - ProteomicsDB",114,32188942,"MaxQuant score",95.4010000,0.9762600,,,,0.0013780300505459,
TELSDSSPIK,ph,S,249,true,"atm and atr DNA damage response",88,25561503,"MASCOT Score",27.0000000,0.9900000,,,,,-0.5200000
TELSDSSPIK,ph,S,249,true,"TOR Kinase and ABA Receptor",100,29290610,XCorr,2.9878452,0.9530000,,,,0.063280001282692,
TELSDSSPIKSWGK,ph,S,250,true,"Tissue atlas Arabidopsis - ProteomicsDB",114,32188942,"MaxQuant score",264.4300000,0.9864190,,,,0,
TELSDSSPIK,ph,S,250,true,"atm and atr DNA damage response",88,25561503,"MASCOT Score",27.0000000,1.0000000,,,,,-0.5200000
KLDSDKDTTLLMDMER,ph,S,288,true,"Tissue atlas Arabidopsis - ProteomicsDB",114,32188942,"MaxQuant score",111.8800000,0.9646430,,,,7.5947198752147E-8,
VKVEEAECNDSDDNGEACSATQGLR,ph,S,328,true,"Tissue atlas Arabidopsis - ProteomicsDB",114,32188942,"MaxQuant score",139.0100000,1.0000000,,,,1.0623599789643E-35,
VEEAECNDSDDNGEACSATQGLR,ph,S,328,true,"Conserved plant phosphoproteome - Arabidopsis",61a,20466843,"MASCOT Score",53.0000000,1.0000000,,,,,
YSPRSPK,ph,S,363,true,"TOR Kinase and ABA Receptor",100,29290610,XCorr,2.6451514,0.9505000,,,,0.0056300000287592,
LQPQTSGSLR,ph,S,477,true,"Tissue atlas Arabidopsis - ProteomicsDB",114,32188942,"MaxQuant score",84.3090000,0.8416500,,,,0.0020968900062144,
KRPGMDIVASPK,ph,S,558,true,"TOR Kinase and ABA Receptor",100,29290610,XCorr,2.6837308,1.0000000,,,,0.0084429997950792,
KRPGMDIVASPK,ph,S,558,true,"Phospho cell culture sucrose/TOR",109,30833711,,,1.0000000,,,,,
RPGMDIVASPK,ph,S,558,true,"Tissue atlas Arabidopsis - ProteomicsDB",114,32188942,"MaxQuant score",161.2600000,1.0000000,,,,1.6821399828615E-10,
QVSDSGPTSLSQKPPNR,ph,S,563,true,"Tissue atlas Arabidopsis - ProteomicsDB",114,32188942,"MaxQuant score",102.0700000,0.9921560,,,,6.9729702545374E-7,
SLSEQELLLK,ph,S,605,true,"Tissue atlas Arabidopsis - ProteomicsDB",114,32188942,"MaxQuant score",117.7900000,0.9980890,,,,0.00016969599528238,
