Peptide,PTM,ModifiedAA,ModifiedPosition,PeptideUniqueToGene,ExperimentDesc,ExpID,PubmedID,ScoreType,IdentScore,LocProb,Log2FChange,PQ-val,QuantSig,PEP,MassErrorPPM
VVSGVNLSPR,ph,S,58,true,"TOR Kinase and ABA Receptor",100,29290610,XCorr,3.5116122,1.0000000,,,,0.00042070000199601,
VVSGVNLSPR,ph,S,58,true,"Tissue atlas Arabidopsis - ProteomicsDB",114,32188942,"MaxQuant score",162.9300000,1.0000000,,,,4.5667698600482E-7,
LTMSQEDDGPKTPETQQK,ph,T,153,true,"Tissue atlas Arabidopsis - ProteomicsDB",114,32188942,"MaxQuant score",86.1820000,0.9242060,,,,4.1191298805643E-5,
TMSPVIAR,ph,S,260,true,"Tissue atlas Arabidopsis - ProteomicsDB",114,32188942,"MaxQuant score",91.8670000,0.9999720,,,,0.0065232301130891,
VLVSPTRNGSNSVRK,ph,S,306,true,"Conserved plant phosphoproteome - Arabidopsis",61a,20466843,"MASCOT Score",29.0000000,0.7502172,,,,,
VLVSPTRNGSNSVRK,ph,T,308,true,"Conserved plant phosphoproteome - Arabidopsis",61a,20466843,"MASCOT Score",29.0000000,0.7502172,,,,,
VLVSPTRNGSNSVRK,ph,T,308,true,"srk2dei ABA signaling phopshoproteomics",83,23572148,"MASCOT Score",28.0000000,,,,,,0.0034000
VLVSPTRNGSNSVRK,ph,S,312,true,"srk2dei ABA signaling phopshoproteomics",83,23572148,"MASCOT Score",28.0000000,,,,,,0.0034000
VLVSPTRNGSNSVRK,ph,S,314,true,"srk2dei ABA signaling phopshoproteomics",83,23572148,"MASCOT Score",28.0000000,,,,,,0.0034000
SASISPIR,ph,S,337,true,"atm and atr DNA damage response",88,25561503,"MASCOT Score",32.0000000,0.9910000,,,,,-0.9200000
SASISPIR,ph,S,337,true,"Tissue atlas Arabidopsis - ProteomicsDB",114,32188942,"MaxQuant score",94.3630000,0.9998900,,,,0.0049201799556613,
SASISPIR,ph,S,339,true,"atm and atr DNA damage response",88,25561503,"MASCOT Score",32.0000000,0.9190000,,,,,-0.9200000
SASISPIR,ph,S,339,true,"Tissue atlas Arabidopsis - ProteomicsDB",114,32188942,"MaxQuant score",123.7500000,1.0000000,,,,0.0029639499261975,
RVTLQAFLSPTR,ph,S,388,true,"Tissue atlas Arabidopsis - ProteomicsDB",114,32188942,"MaxQuant score",178.6700000,0.9530760,,,,5.9629899759259E-14,
