Peptide,PTM,ModifiedAA,ModifiedPosition,PeptideUniqueToGene,ExperimentDesc,ExpID,PubmedID,ScoreType,IdentScore,LocProb,Log2FChange,PQ-val,QuantSig,PEP,MassErrorPPM
PGSSGSVSGSRDEVSTR,ph,S,13,true,"Tissue atlas Arabidopsis - ProteomicsDB",114,32188942,"MaxQuant score",96.5910000,0.9690750,,,,1.4793899936194E-6,
IESNRHQVNNVSVTK,ph,S,27,true,"TOR Kinase and ABA Receptor",100,29290610,XCorr,2.6822753,1.0000000,,,,0.076030001044273,
IESNRHQVNNVSVTK,ph,S,27,true,"Phospho cell culture sucrose/TOR",109,30833711,,,0.9956440,,,,,
IESNRHQVNNVSVTK,ph,S,27,true,"Tissue atlas Arabidopsis - ProteomicsDB",114,32188942,"MaxQuant score",198.1400000,1.0000000,,,,3.658869946883E-35,
HQVNNVSVTK,ph,S,36,true,"Tissue atlas Arabidopsis - ProteomicsDB",114,32188942,"MaxQuant score",140.4500000,0.9996910,,,,4.9729401325749E-6,
YMDHDLAGLAASPEIK,ph,Y,218,true,"SnRK2 protein kinase substrates",85,23776212,XCorr,2.0844860,0.9890000,,,,0.10012099891901,
QEMTNRVVTLWYR,ph,T,296,true,"Tissue atlas Arabidopsis - ProteomicsDB",114,32188942,"MaxQuant score",75.5740000,0.9999470,,,,0.0010144599946216,
FPPPHQDGSLGFQVGSSR,ph,S,528,true,"Tissue atlas Arabidopsis - ProteomicsDB",114,32188942,"MaxQuant score",123.6500000,0.8762990,,,,2.7248799191418E-14,
FPPPHQDGSLGFQVGSSR,ph,S,529,true,"TOR Kinase and ABA Receptor",100,29290610,XCorr,3.7784925,0.8435000,,,,0.00024920000578277,
RLDPSEIPYSTNSFTSSYSK,ph,S,540,true,"Tissue atlas Arabidopsis - ProteomicsDB",114,32188942,"MaxQuant score",102.2700000,0.9387690,,,,3.5753999760857E-9,
RLDPSEIPYSTNSFTSSYSK,ph,T,541,true,"Tissue atlas Arabidopsis - ProteomicsDB",114,32188942,"MaxQuant score",145.0500000,0.7519450,,,,1.1122299786283E-23,
RLDPSEIPYSTNSFTSSYSK,ph,S,543,true,"TOR Kinase and ABA Receptor",100,29290610,XCorr,4.8666501,0.8419000,,,,3.6690000371209E-8,
RLDPSEIPYSTNSFTSSYSK,ph,S,543,true,"Phospho cell culture sucrose/TOR",109,30833711,,,0.7649140,,,,,
RLDPSEIPYSTNSFTSSYSK,ph,S,543,true,"Tissue atlas Arabidopsis - ProteomicsDB",114,32188942,"MaxQuant score",221.1400000,0.9986860,,,,0,
EPFQTWSGPLAPIGAPDSTTR,ph,T,555,true,"TOR Kinase and ABA Receptor",100,29290610,XCorr,3.9060669,0.8941000,,,,0.00079670001287013,
EPFQTWSGPLAPIGAPDSTTR,ph,S,557,true,"Lateral root-induction - NAA vs control",106,23328941,"MASCOT Score",44.0000000,,,,,,
