Peptide,PTM,ModifiedAA,ModifiedPosition,PeptideUniqueToGene,ExperimentDesc,ExpID,PubmedID,ScoreType,IdentScore,LocProb,Log2FChange,PQ-val,QuantSig,PEP,MassErrorPPM
AEKAVTIRTR,nt,A,2,false,"N-term acetylation drought responses",5,26184543,,,,,,,,
AEKAVTIR,nt,A,2,false,"Arg/N-end rule seed, prt6 vs. Wt",99,29168982,"MASCOT Score",29.5600000,,,,,0.053539998829365,-4.0011064
AEKAVTIR,nt,A,2,false,"FtsH12 N-terminome: WT / FtsH12 knockdown miRNA",118,33216923,"MaxQuant score",48.7940000,,,,,0.061117000877857,
AEKAVTIRTR,nta,A,2,false,"N-term acetylation drought responses",5,26184543,,,,,,,,
AEKAVTIR,nta,A,2,false,"Arg/N-end rule pathway Roots",80,25728785,"MASCOT Score",46.0800000,,,,,0.04092999920249,
AEKAVTIR,nta,A,2,false,"Arg/N-end rule seed, prt6 vs. Wt",99,29168982,"MASCOT Score",29.5600000,,-0.0300594,0.6696235,NO,0.053539998829365,-4.0011064
AEKAVTIR,ub,K,4,false,"Arabidopsis ubiquitination COFRADIC",40,26744219,"MaxQuant Score",72.6070000,1.0000000,,,,0.00057819997891784,-0.0140000
AEKAVTIR,ub,K,4,false,"upl3 mutant / wildtype",168,35926874,"MaxQuant score",57.5900000,1.0000000,,,,0.013823200017214,2.3610000
KQFVIDVLHPGR,ac,K,22,false,"Histone deacetylases - apicidin vs control",98a,29061669,"MaxQuant Score",109.0000000,1.0000000,-0.2360000,0.3459394,NO,1.200000042445E-6,
KQFVIDVLHPGR,ac,K,22,false,"Histone deacetylases- hda14 vs WT (low light)",98c,29061669,"MaxQuant Score",127.0200000,1.0000000,0.1160000,0.9885531,NO,3.3999999686785E-6,
KQFVIDVLHPGR,nt,K,22,false,"Arabidopsis translation initiation landscape - NT",167b,35069635,,,,,,,,
ANVSKAELK,ac,K,38,false,"Histone deacetylases - apicidin vs control",98a,29061669,"MaxQuant Score",108.4000000,1.0000000,-0.2550000,0.2296149,NO,0.003000000026077,
ANVSKAELK,ac,K,38,false,"Histone deacetylases substrates - hda14 vs WT",98e,29061669,"MaxQuant Score",59.9000000,1.0000000,0.0910000,0.9120108,NO,0.0089999996125698,
ANVSKAELK,ac,K,38,false,"Quantitative Acetylproteomics",101,29440448,,,,,,,,
ANVSKAELKEKLAR,ub,K,38,false,"Arabidopsis ubiquitination COFRADIC",40,26744219,"MaxQuant Score",98.9430000,1.0000000,,,,5.418999915463E-9,0.2450000
ANVSKAELKEKLAR,ub,K,42,false,"Arabidopsis ubiquitination COFRADIC",40,26744219,"MaxQuant Score",96.6730000,0.9700000,,,,5.4030001592764E-6,-0.2740000
ANVSKAELKEKLAR,ub,K,44,false,"Arabidopsis ubiquitination COFRADIC",40,26744219,"MaxQuant Score",71.9800000,0.9930000,,,,2.9060000088066E-5,0.3860000
LARMYEVK,mox,M,48,false,"cat2 Methionine oxidation - 1h stress",62a,25693801,"MASCOT Score",50.0000000,,0.3958292,,NO,,
THFGGGKSSGFGLIYDTVESAK,ac,K,70,true,"Quantitative Acetylproteomics",101,29440448,,,,,,,,
GLIYDTVESAKKFEPKY,nt,G,75,true,"Arabidopsis translation initiation landscape - NT",167b,35069635,,,,,,,,
KFEPKYR,ac,K,90,false,"Quantitative Acetylproteomics",101,29440448,,,,,,,,
NGLDTKIEK,ac,K,101,false,"Quantitative Acetylproteomics",101,29440448,,,,,,,,
NGLDTKIEKSR,ub,K,101,false,"Arabidopsis ubiquitination COFRADIC",40,26744219,"MaxQuant Score",80.6900000,0.9940000,,,,6.212999892341E-7,-0.1580000
NGLDTKIEKSR,ub,K,104,false,"Arabidopsis ubiquitination COFRADIC",40,26744219,"MaxQuant Score",98.1050000,1.0000000,,,,6.9620003671383E-18,-1.9210000
GVKKTKAGDAKKK,ub,K,123,true,"Arabidopsis ubiquitination COFRADIC",40,26744219,"MaxQuant Score",71.9800000,0.9440000,,,,0.00033839998650365,0.4520000
GVKKTKAGDAKKK,ub,K,126,true,"Arabidopsis ubiquitination COFRADIC",40,26744219,"MaxQuant Score",85.4930000,0.9980000,,,,9.5230003353208E-5,1.1270000
GVKKTKAGDAKKK,ub,K,133,true,"Arabidopsis ubiquitination COFRADIC",40,26744219,"MaxQuant Score",71.9800000,1.0000000,,,,0.00056180002866313,0.2070000
