Peptide,PTM,ModifiedAA,ModifiedPosition,PeptideUniqueToGene,ExperimentDesc,ExpID,PubmedID,ScoreType,IdentScore,LocProb,Log2FChange,PQ-val,QuantSig,PEP,MassErrorPPM
SVDMEDSVGPLYR,ph,S,292,true,"Lateral root-induction - NAA vs control",106,23328941,"MASCOT Score",33.0000000,,,,,,
SVDMEDSVGPLYR,ph,S,292,true,"Tissue atlas Arabidopsis - ProteomicsDB",114,32188942,"MaxQuant score",179.5900000,1.0000000,,,,3.0072099672525E-22,
SVDMEDSVGPLYR,ph,S,298,true,"Tissue atlas Arabidopsis - ProteomicsDB",114,32188942,"MaxQuant score",116.1900000,1.0000000,,,,2.5228300728486E-5,
QYSNGNYPSNSSSLNR,ph,Y,326,true,"Large-scale phosphorylation discovery",44,23111157,XCorr,3.8160000,,,,,,
QYSNGNYPSNSSSLNR,ph,S,327,true,"Large-scale phosphorylation discovery",44,23111157,XCorr,4.2090000,,,,,,
QYSNGNYPSNSSSLNR,ph,S,327,true,"SnRK2 protein kinase substrates",85,23776212,XCorr,3.0885067,0.9790000,,,,4.9746099648473E-6,
QYSNGNYPSNSSSLNR,ph,S,327,true,"atm and atr DNA damage response",88,25561503,"MASCOT Score",35.0000000,0.9940000,,,,,-0.3000000
QYSNGNYPSNSSSLNR,ph,S,327,true,"TOR Kinase and ABA Receptor",100,29290610,XCorr,4.9353919,0.8979000,,,,1.9409999367781E-6,
QYSNGNYPSNSSSLNR,ph,S,327,true,"Tissue atlas Arabidopsis - ProteomicsDB",114,32188942,"MaxQuant score",227.6300000,1.0000000,,,,0,
SGNVDITIK,ph,T,392,true,"srk2dei ABA signaling phopshoproteomics",83,23572148,"MASCOT Score",23.0000000,,,,,,-0.0015000
TSMGSVMDFLR,ph,S,497,true,"atm and atr DNA damage response",88,25561503,"MASCOT Score",52.0000000,0.9930000,,,,,-0.1700000
LQQQQESR,ph,S,552,true,"atm and atr DNA damage response",88,25561503,"MASCOT Score",37.0000000,1.0000000,,,,,0.0000000
TRWPESGEEVEISPK,ph,S,655,true,"srk2dei ABA signaling phopshoproteomics",83,23572148,"MASCOT Score",56.0000000,,,,,,0.0011000
TRWPESGEEVEISPK,ph,S,655,true,"SnRK2 protein kinase substrates",85,23776212,XCorr,3.6061096,1.0000000,,,,2.0391100861161E-6,
TRWPESGEEVEISPK,ph,S,655,true,"TOR Kinase and ABA Receptor",100,29290610,XCorr,5.6890049,1.0000000,,,,1.5399999497845E-8,
WPESGEEVEISPK,ph,S,655,true,"Tissue atlas Arabidopsis - ProteomicsDB",114,32188942,"MaxQuant score",204.2300000,1.0000000,,,,9.5732605278171E-39,
DGFLGSVSGLGR,ph,S,663,true,"atm and atr DNA damage response",88,25561503,"MASCOT Score",58.0000000,0.9970000,,,,,-0.8700000
DGFLGSVSGLGR,ph,S,663,true,"Tissue atlas Arabidopsis - ProteomicsDB",114,32188942,"MaxQuant score",67.9640000,0.9837070,,,,0.0058269998989999,
RTTSLPVDAIDS,ph,T,690,true,"srk2dei ABA signaling phopshoproteomics",83,23572148,"MASCOT Score",38.0000000,,,,,,0.0009000
RTTSLPVDAIDS,ph,T,690,true,"TOR Kinase and ABA Receptor",100,29290610,XCorr,3.1020002,0.8760000,,,,0.061889998614788,
RTTSLPVDAIDS,ph,T,691,true,"srk2dei ABA signaling phopshoproteomics",83,23572148,"MASCOT Score",32.0000000,,,,,,0.0007000
RTTSLPVDAIDS,ph,S,692,true,"Large-scale phosphorylation discovery",44,23111157,XCorr,2.9740000,,,,,,
RTTSLPVDAIDS,ph,S,692,true,"srk2dei ABA signaling phopshoproteomics",83,23572148,"MASCOT Score",52.0000000,,,,,,0.0001000
RTTSLPVDAIDS,ph,S,692,true,"SnRK2 protein kinase substrates",85,23776212,XCorr,2.0205164,0.9160000,,,,6.2138198700268E-5,
RTTSLPVDAIDS,ph,S,692,true,"atm and atr DNA damage response",88,25561503,"MASCOT Score",42.0000000,0.9990000,,,,,0.3900000
TTSLPVDAIDS,ph,S,692,true,"LAXIC - ABA stress",84a,23660473,XCorr,2.6300000,0.9880000,,,,0.052868399769068,
TTSLPVDAIDS,ph,S,692,true,"LAXIC - mannitol vs control",84b,23660473,XCorr,2.5700000,0.9980000,,,,0.00079145299969241,
TTSLPVDAIDS,ph,S,692,true,"SnRK2 protein kinase substrates",85,23776212,XCorr,2.1837456,0.9910000,,,,0.03897950053215,
TTSLPVDAIDS,ph,S,692,true,"atm and atr DNA damage response",88,25561503,"MASCOT Score",29.0000000,0.9190000,,,,,0.2000000
TTSLPVDAIDS,ph,S,692,true,"Tissue atlas Arabidopsis - ProteomicsDB",114,32188942,"MaxQuant score",157.0900000,0.9152860,,,,7.2073297330277E-10,
