Peptide,PTM,ModifiedAA,ModifiedPosition,PeptideUniqueToGene,ExperimentDesc,ExpID,PubmedID,ScoreType,IdentScore,LocProb,Log2FChange,PQ-val,QuantSig,PEP,MassErrorPPM
FLVTDTVDGPDSTSKCIR,so,C,185,true,"Arabidopsis S-sulfenylation chemoproteomics",108,31578252,"pFind PSM Score",0.0031909,,1.6393400,,,,-0.4156674
VGSTEEIEDESMK,ph,S,634,true,"Tyrosine phosphorylation in Arabidopsis",59,18463617,"MASCOT Score",51.0000000,,,,,,-0.7177373
VGSTEEIEDESMK,ph,S,634,true,"Conserved plant phosphoproteome - Arabidopsis",61a,20466843,"MASCOT Score",51.0000000,1.0000000,,,,,
VGSTEEIEDESMK,ph,S,634,true,"srk2dei ABA signaling phopshoproteomics",83,23572148,"MASCOT Score",72.0000000,,,,,,-0.0014000
VGSTEEIEDESMK,ph,S,634,true,"atm and atr DNA damage response",88,25561503,"MASCOT Score",87.0000000,0.9530000,,,,,-0.6700000
VGSTEEIEDESMK,ph,S,634,true,"TOR Kinase and ABA Receptor",100,29290610,XCorr,4.5899310,0.9927000,,,,2.9059999633319E-6,
VGSTEEIEDESMK,ph,S,634,true,"Lateral root-induction - NAA vs control",106,23328941,"MASCOT Score",50.0000000,,,,,,
VGSTEEIEDESMK,ph,S,634,true,"Phospho cell culture sucrose/TOR",109,30833711,,,0.9986930,,,,,
VGSTEEIEDESMK,ph,S,634,true,"Tissue atlas Arabidopsis - ProteomicsDB",114,32188942,"MaxQuant score",252.1200000,0.9994370,,,,0,
SDTNPHDSGETNLK,ph,S,652,true,"TOR Kinase and ABA Receptor",100,29290610,XCorr,4.1471567,0.9994000,,,,1.4889999874867E-5,
SDTNPHDSGETNLK,ph,S,652,true,"Tissue atlas Arabidopsis - ProteomicsDB",114,32188942,"MaxQuant score",106.8700000,0.9849840,,,,9.132300328929E-5,
SDTNPHDSGETNLKDQTDSNEAEKDTGNPDSEQTQMALK,ph,S,663,true,"Phospho cell culture sucrose/TOR",109,30833711,,,0.8606910,,,,,
