Peptide,PTM,ModifiedAA,ModifiedPosition,PeptideUniqueToGene,ExperimentDesc,ExpID,PubmedID,ScoreType,IdentScore,LocProb,Log2FChange,PQ-val,QuantSig,PEP,MassErrorPPM
SVKAQSVALSQDDLKKLAAE,nt,S,35,true,"Stromal N-terminome",96,26371235,"MASCOT Score",40.3700000,,,,,,
SVKAQSVALSQDD,nt,S,35,true,"HUNTER N-terminome: legumain, GluC and trypsin",119,31951383,"MaxQuant score",164.1100000,,,,,,
SVALSQDDLKKLAAE,nt,S,40,true,"N-terminal ChaFRADIC",92,26010716,"MASCOT Score",27.3600000,,,,,0.000116800001706,
SVALSQDDLK,nta,S,40,true,"Characterization plant N-terminal acetylation",6,22223895,"MASCOT Score",72.9100000,,,,,,
LLSSGELYDIVGIPTSKR,ac,K,100,true,"Quantitative Acetylproteomics",101,29440448,,,,,,,,
RTEEQARSLGIPLVGLDTHPR,ph,T,102,true,"TOR Kinase and ABA Receptor",100,29290610,XCorr,3.4653075,0.9158000,,,,2.4080000002868E-5,
SLGIPLVGLDTHPR,nt,S,108,true,"Tic56 chloroplast import - wild-type",89a,25588737,XCorr,3.3651032,,,,,,
SLGIPLVGLDTHPR,nt,S,108,true,"N-terminal ChaFRADIC",92,26010716,"MASCOT Score",51.6100000,,,,,4.7339998587859E-9,
SLGIPLVGLD,nt,S,108,true,"N-terminal ChaFRADIC",92,26010716,"MASCOT Score",23.4400000,,,,,0.15749999880791,
SLGIPLVGLDTHPR,ph,S,108,true,"STN8 phosphoproteome",38,21768351,"MASCOT Score",58.9800000,,,,,,-1.2420400
SLGIPLVGLDTHPR,ph,S,108,true,"Chloroplast kinase substrates",60,19376835,"MASCOT Score",38.4000000,,,,,,-1.0749300
SLGIPLVGLDTHPR,ph,S,108,true,"atm and atr DNA damage response",88,25561503,"MASCOT Score",55.0000000,1.0000000,,,,,-0.1800000
SLGIPLVGLDTHPR,ph,S,108,true,"TOR Kinase and ABA Receptor",100,29290610,XCorr,2.9580674,1.0000000,,,,0.0013109999708831,
SLGIPLVGLDTHPR,ph,S,108,true,"Tissue atlas Arabidopsis - ProteomicsDB",114,32188942,"MaxQuant score",99.5660000,1.0000000,,,,0.00013494800077751,
IDLAIDGADEVDPNLDLVKGR,ac,K,140,true,"Histone deacetylases substrates - hda14 vs WT",98e,29061669,"MaxQuant Score",130.0000000,1.0000000,0.0980000,0.9571941,NO,1.3004049748934E-42,
MVEAVADK,mox,M,151,true,"cat2 Methionine oxidation - 1h stress",62a,25693801,"MASCOT Score",54.0000000,,0.0712245,,NO,,
MVEAVADK,mox,M,151,true,"cat2 Methionine oxidation - 3h stress",62b,25693801,"MASCOT Score",37.0000000,,-0.3466764,,NO,,
DLFKEFGCESKLR,nt,D,197,true,"Metacaspase9 substrates - Col-0 / mc9",51a,23964026,"MASCOT Score",62.0000000,,1.2167735,,NO,,-2.1621941
DLFKEFGCESKLR,nt,D,197,true,"Metacaspase9 substrates - 35S:MC9 / mc9",51b,23964026,"MASCOT Score",63.0000000,,1.2039071,,NO,,-3.9174387
LQDLFKEFGCESK,ac,K,200,true,"Histone deacetylases substrates - hda14 vs WT",98e,29061669,"MaxQuant Score",82.7000000,1.0000000,-0.1410000,0.9099133,NO,3.0999999580672E-6,
LQDLFKEFGCESK,sno,C,204,true,"Site-specific nitrosomeproteomic id - gsnor1-3",90a,25699590,XCorr,2.3119514,,,,,0.00055539997993037,-5.8031151
EFGCESK,sno,C,204,true,"hot5-4 / wildtype, FAT-switch S-nitrosoproteome",169,37277371,,,,0.4631761,0.2562834,NO,,
EFGCESKLR,ac,K,207,true,"Histone deacetylases substrates - hda14 vs WT",98e,29061669,"MaxQuant Score",40.5000000,1.0000000,-0.0720000,0.9120108,NO,0.029999999329448,
DGFAAAKEIGK,ac,K,242,true,"Histone deacetylases - apicidin vs control",98a,29061669,"MaxQuant Score",81.9000000,1.0000000,0.0450000,0.8649679,NO,1.900000029309E-6,
