Peptide,PTM,ModifiedAA,ModifiedPosition,PeptideUniqueToGene,ExperimentDesc,ExpID,PubmedID,ScoreType,IdentScore,LocProb,Log2FChange,PQ-val,QuantSig,PEP,MassErrorPPM
GPSGPGESASNVR,nt,G,66,true,"Tic56 chloroplast import - tic56-1",89c,25588737,XCorr,2.4602506,,,,,,
GPSGPGESASNVR,nt,G,66,true,"N-terminal ChaFRADIC",92,26010716,"MASCOT Score",56.4400000,,,,,7.5060000881422E-7,
GPGESASNVR,nt,G,69,true,"Tic56 chloroplast import - tic56-1",89c,25588737,XCorr,2.8442636,,,,,,
GPGESASNVR,nt,G,69,true,"Arg/N-end rule seed, prt6 vs. Wt",99,29168982,"MASCOT Score",35.7500000,,-0.4698379,0.0837097,NO,0.063230000436306,-1.2141006
YGWTAFCGPAGPR,ox,C,121,true,"SPEAR - 10 mM H2O2 / mock",138a,34619326,,,,1.2188726,0.0026718,YES,,
YGWTAFCGPAGPR,ox,C,121,true,"SPEAR - 50 mM H2O2 / mock",138b,34619326,,,,1.1646136,0.0012730,YES,,
GQASCGK,sno,C,132,true,"hot5-4 / wildtype, FAT-switch S-nitrosoproteome",169,37277371,,,,-0.9650019,0.0065786,YES,,
SNGGLDLDVA,nt,S,156,true,"N-terminal ChaFRADIC",92,26010716,"MASCOT Score",45.0800000,,,,,0.0027890000492334,
