Peptide,PTM,ModifiedAA,ModifiedPosition,PeptideUniqueToGene,ExperimentDesc,ExpID,PubmedID,ScoreType,IdentScore,LocProb,Log2FChange,PQ-val,QuantSig,PEP,MassErrorPPM
SNNGSHLSNLAAGLCR,ph,S,488,false,"Tissue atlas Arabidopsis - ProteomicsDB",114,32188942,"MaxQuant score",223.9300000,0.9999900,,,,0,
SNNGSHLSNLAAGLCR,ph,S,492,false,"Tissue atlas Arabidopsis - ProteomicsDB",114,32188942,"MaxQuant score",156.1500000,0.9999820,,,,1.4211499815495E-13,
SNNGSHLSNLAAGLCR,ph,S,495,false,"Tissue atlas Arabidopsis - ProteomicsDB",114,32188942,"MaxQuant score",148.6900000,0.9988480,,,,1.8041099965466E-21,
RFSLPEIK,ph,S,506,true,"Tissue atlas Arabidopsis - ProteomicsDB",114,32188942,"MaxQuant score",83.0810000,1.0000000,,,,0.0061959899030626,
TGPNMNGGHVTTVVK,ph,T,675,false,"Tissue atlas Arabidopsis - ProteomicsDB",114,32188942,"MaxQuant score",174.0000000,1.0000000,,,,9.8399602415573E-18,
TGPNMNGGHVTTVVK,ph,T,676,false,"Tissue atlas Arabidopsis - ProteomicsDB",114,32188942,"MaxQuant score",174.0000000,1.0000000,,,,9.8399602415573E-18,
GSFGYLDPEYFR,ph,S,681,false,"Plasmamembrane phosphorylation",20,15308754,,,,,,,,
GSFGYLDPEYFR,ph,S,681,false,"Pollen phosphoproteome Arabidopsis",43,22631563,"MASCOT Score",45.2500000,,,,,,
GSFGYLDPEYFR,ph,S,681,false,"Tyrosine phosphorylation in Arabidopsis",59,18463617,"MASCOT Score",29.0000000,,,,,,-0.9806349
GSFGYLDPEYFR,ph,S,681,false,"TOR Kinase and ABA Receptor",100,29290610,XCorr,3.2853138,0.9999000,,,,0.0030320000369102,
GSFGYLDPEYFR,ph,S,681,false,"Tissue atlas Arabidopsis - ProteomicsDB",114,32188942,"MaxQuant score",101.3900000,0.9999880,,,,0.00012155299918959,
HRTPNNGGSSEDLGR,ph,T,804,true,"Tissue atlas Arabidopsis - ProteomicsDB",114,32188942,"MaxQuant score",62.0990000,0.9999100,,,,0.00162413995713,
HRTPNNGGSSEDLGR,ph,S,810,true,"Tissue atlas Arabidopsis - ProteomicsDB",114,32188942,"MaxQuant score",218.2100000,0.9936510,,,,0,
