Peptide,PTM,ModifiedAA,ModifiedPosition,PeptideUniqueToGene,ExperimentDesc,ExpID,PubmedID,ScoreType,IdentScore,LocProb,Log2FChange,PQ-val,QuantSig,PEP,MassErrorPPM
KYVTPEQALAAK,ph,T,116,true,"Tissue atlas Arabidopsis - ProteomicsDB",114,32188942,"MaxQuant score",101.2000000,0.9999960,,,,0.00029122398700565,
YVTPEQALAAKKLASSASSSSAK,ac,K,124,true,"Histone deacetylases - apicidin vs control",98a,29061669,"MaxQuant Score",148.3000000,1.0000000,1.8330000,0.0007464,YES,9.4999997451994E-12,
YVTPEQALAAKKLASSASSSSAK,ac,K,124,true,"Histone deacetylases substrates - TSA vs control",98b,29061669,"MaxQuant Score",148.3000000,1.0000000,2.5730000,0.1845015,NO,9.4999997451994E-12,
KYVTPEQALAAKK,ac,K,124,true,"Quantitative Acetylproteomics",101,29440448,,,,,,,,
YVTPEQALAAKK,ac,K,124,true,"Histone deacetylases- hda14 vs WT (low light)",98c,29061669,"MaxQuant Score",126.3200000,1.0000000,-0.1340000,0.9885531,NO,9.699999645818E-5,
YVTPEQALAAKK,ac,K,124,true,"Histone deacetylases - hda14 vs WT (thylakoids)",98d,29061669,"MaxQuant Score",92.2000000,1.0000000,0.3990000,0.8892011,NO,2.9999999242136E-5,
YVTPEQALAAKK,ac,K,124,true,"Histone deacetylases substrates - hda14 vs WT",98e,29061669,"MaxQuant Score",86.8000000,1.0000000,0.1300000,0.9099133,NO,3.0000001061126E-6,
YVTPEQALAAKK,ac,K,124,true,"Quantitative Acetylproteomics",101,29440448,,,,,,,,
YVTPEQALAAKKLASSASSSSAK,ac,K,125,true,"Histone deacetylases - apicidin vs control",98a,29061669,"MaxQuant Score",148.3000000,1.0000000,1.8330000,0.0007464,YES,9.4999997451994E-12,
YVTPEQALAAKKLASSASSSSAK,ac,K,125,true,"Histone deacetylases substrates - TSA vs control",98b,29061669,"MaxQuant Score",148.3000000,1.0000000,2.5730000,0.1845015,NO,9.4999997451994E-12,
KLASSASSSSAKQR,ac,K,136,true,"Quantitative Acetylproteomics",101,29440448,,,,,,,,
LASSASSSSAKQR,ac,K,136,true,"Quantitative Acetylproteomics",101,29440448,,,,,,,,
ELAAVTGGTVSTNSGSSK,ph,S,150,true,"atm and atr DNA damage response",88,25561503,"MASCOT Score",77.0000000,0.9970000,,,,,0.6700000
ELAAVTGGTVSTNSGSSK,ph,S,150,true,"Tissue atlas Arabidopsis - ProteomicsDB",114,32188942,"MaxQuant score",197.6700000,0.8123200,,,,0,
ELAAVTGGTVSTNSGSSK,ph,S,153,true,"atm and atr DNA damage response",88,25561503,"MASCOT Score",51.0000000,0.9310000,,,,,1.1200000
ELAAVTGGTVSTNSGSSK,ph,S,156,true,"TOR Kinase and ABA Receptor",100,29290610,XCorr,4.8124037,0.9949000,,,,3.3340000982207E-7,
