Peptide,PTM,ModifiedAA,ModifiedPosition,PeptideUniqueToGene,ExperimentDesc,ExpID,PubmedID,ScoreType,IdentScore,LocProb,Log2FChange,PQ-val,QuantSig,PEP,MassErrorPPM
RVPGAMTDEELFAVDEER,ph,T,317,true,"Tissue atlas Arabidopsis - ProteomicsDB",114,32188942,"MaxQuant score",102.2100000,1.0000000,,,,3.410229965084E-7,
TAVTNGAETDGFEDVLTPEER,ph,T,337,true,"Tissue atlas Arabidopsis - ProteomicsDB",114,32188942,"MaxQuant score",148.5700000,0.9999990,,,,1.4364600249579E-28,
TAVTNGAETDGFEDVLTPEER,ph,T,345,true,"TOR Kinase and ABA Receptor",100,29290610,XCorr,4.4336019,0.9994000,,,,0.00088000000687316,
TAVTNGAETDGFEDVLTPEER,ph,T,345,true,"Tissue atlas Arabidopsis - ProteomicsDB",114,32188942,"MaxQuant score",215.8900000,1.0000000,,,,0,
FEELQAAEEEFSTPPSSPVFHDAK,ph,S,542,true,"Brassinosteroid-Regulated Phosphorylation Dynamics",94,26187819,"MaxQuant Score",106.7300000,0.7520000,,,,7.1229999321076E-7,-0.3650000
FEELQAAEEEFSTPPSSPVFHDAK,ph,T,543,true,"Phosphorylation Early Elicitor Signaling",23,17317660,,,,,,,,
FEELQAAEEEFSTPPSSPVFHDAK,ph,T,543,true,"Large-scale phosphorylation discovery",44,23111157,XCorr,5.4700000,,,,,,
FEELQAAEEEFSTPPSSPVFHDAK,ph,T,543,true,"srk2dei ABA signaling phopshoproteomics",83,23572148,"MASCOT Score",81.0000000,,,,,,-0.0001000
FEELQAAEEEFSTPPSSPVFHDAK,ph,T,543,true,"LAXIC - mannitol vs control",84b,23660473,XCorr,4.8800000,0.8360000,1.1954833,,NO,3.0100000270039E-10,
FEELQAAEEEFSTPPSSPVFHDAK,ph,T,543,true,"SnRK2 protein kinase substrates",85,23776212,XCorr,4.0437417,0.9340000,,,,3.96250006599E-16,
FEELQAAEEEFSTPPSSPVFHDAK,ph,T,543,true,"Brassinosteroid-Regulated Phosphorylation Dynamics",94,26187819,"MaxQuant Score",134.4500000,0.9920000,,,,3.0819999885523E-9,-1.8460000
FEELQAAEEEFSTPPSSPVFHDAK,ph,T,543,true,"TOR Kinase and ABA Receptor",100,29290610,XCorr,5.2976079,0.8688000,,,,4.3549999872994E-7,
FEELQAAEEEFSTPPSSPVFHDAK,ph,T,543,true,"Tissue atlas Arabidopsis - ProteomicsDB",114,32188942,"MaxQuant score",207.1900000,0.9859130,,,,0,
FEELQAAEEEFSTPPSSPVFHDAK,ph,S,546,true,"Phosphorylation Early Elicitor Signaling",23,17317660,,,,,,,,
FEELQAAEEEFSTPPSSPVFHDAK,ph,S,546,true,"srk2dei ABA signaling phopshoproteomics",83,23572148,"MASCOT Score",61.0000000,,,,,,-0.0010000
FEELQAAEEEFSTPPSSPVFHDAK,ph,S,546,true,"Brassinosteroid-Regulated Phosphorylation Dynamics",94,26187819,"MaxQuant Score",106.7300000,0.8120000,,,,7.1229999321076E-7,1.7690000
FEELQAAEEEFSTPPSSPVFHDAK,ph,S,546,true,"TOR Kinase and ABA Receptor",100,29290610,XCorr,5.2976079,0.8688000,,,,4.3549999872994E-7,
FEELQAAEEEFSTPPSSPVFHDAK,ph,S,546,true,"Tissue atlas Arabidopsis - ProteomicsDB",114,32188942,"MaxQuant score",189.2400000,0.7517470,,,,0,
FEELQAAEEEFSTPPSSPVFHDAK,ph,S,547,true,"Large-scale phosphorylation discovery",44,23111157,XCorr,5.4700000,,,,,,
FEELQAAEEEFSTPPSSPVFHDAK,ph,S,547,true,"srk2dei ABA signaling phopshoproteomics",83,23572148,"MASCOT Score",85.0000000,,,,,,-0.0009000
FEELQAAEEEFSTPPSSPVFHDAK,ph,S,547,true,"LAXIC - mannitol vs control",84b,23660473,XCorr,4.8800000,0.8570000,1.1954833,,NO,3.0100000270039E-10,
FEELQAAEEEFSTPPSSPVFHDAK,ph,S,547,true,"SnRK2 protein kinase substrates",85,23776212,XCorr,4.0437417,0.9340000,,,,3.96250006599E-16,
FEELQAAEEEFSTPPSSPVFHDAK,ph,S,547,true,"Brassinosteroid-Regulated Phosphorylation Dynamics",94,26187819,"MaxQuant Score",134.4500000,0.9860000,,,,3.0819999885523E-9,1.2950000
FEELQAAEEEFSTPPSSPVFHDAK,ph,S,547,true,"Tissue atlas Arabidopsis - ProteomicsDB",114,32188942,"MaxQuant score",207.1900000,0.8887430,,,,0,
SSSSENSSPSWISWMR,ph,S,561,true,"TOR Kinase and ABA Receptor",100,29290610,XCorr,3.7318211,0.9085000,,,,3.2089999422169E-6,
SSSSENSSPSWISWMR,ph,S,562,true,"Tissue atlas Arabidopsis - ProteomicsDB",114,32188942,"MaxQuant score",160.9300000,0.9915410,,,,2.167269998448E-14,
SSDNDSNRYKDEADPFLIPSDYK,ph,S,579,true,"Phospho cell culture sucrose/TOR",109,30833711,,,0.9522150,,,,,
SSDNDSNRYKDEADPFLIPSDYK,ph,S,579,true,"Tissue atlas Arabidopsis - ProteomicsDB",114,32188942,"MaxQuant score",268.3900000,1.0000000,,,,0,
WIDSAEKK,ph,S,600,true,"Tissue atlas Arabidopsis - ProteomicsDB",114,32188942,"MaxQuant score",77.2880000,1.0000000,,,,0.0078571699559689,
