Peptide,PTM,ModifiedAA,ModifiedPosition,PeptideUniqueToGene,ExperimentDesc,ExpID,PubmedID,ScoreType,IdentScore,LocProb,Log2FChange,PQ-val,QuantSig,PEP,MassErrorPPM
GRGGTSGNKFR,ac,K,13,false,"Quantitative Acetylproteomics",101,29440448,,,,,,,,
GGTSGNKFR,ac,K,13,false,"Histone deacetylases - apicidin vs control",98a,29061669,"MaxQuant Score",74.8000000,1.0000000,-0.1210000,0.5649370,NO,0.017000000923872,
GGTSGNKFR,ac,K,13,false,"Quantitative Acetylproteomics",101,29440448,,,,,,,,
GGTSGNKFR,ub,K,13,false,"Arabidopsis ubiquitination COFRADIC",40,26744219,"MaxQuant Score",111.9500000,1.0000000,,,,0.0020000000949949,-0.8060000
MSLGLPVAATVNCADNTGAK,acy,C,28,false,"Arabidopsis S-acylation atlas - Silique",163e,35681017,,,,,,,,
MSLGLPVAATVNCADNTGAK,sno,C,28,false,"hot5-4 / wildtype, FAT-switch S-nitrosoproteome",169,37277371,,,,,,,,
MSLGLPVAATVNCADNTGAK,so,C,28,false,"S-sulfenylation site detection using YAP1C",110,32714340,,,,,,,,
NLYIISVKGIK,ac,K,43,false,"Histone deacetylases - apicidin vs control",98a,29061669,"MaxQuant Score",89.4000000,1.0000000,1.7970000,0.1815516,NO,0.00098999997135252,
LPSACVGDMVMATVK,ox,C,56,false,"SPEAR - 10 mM H2O2 / mock",138a,34619326,,,,1.2241483,0.0453403,YES,,
LPSACVGDMVMATVK,ox,C,56,false,"SPEAR - 50 mM H2O2 / mock",138b,34619326,,,,1.4381843,0.0284615,YES,,
LPSACVGDMVMATVK,sno,C,56,false,"hot5-4 / wildtype, FAT-switch S-nitrosoproteome",169,37277371,,,,0.1951801,0.0449013,NO,,
LNRLPSACVGDMVMATVKK,so,C,56,false,"S-sulfenylation site detection using YAP1C",110,32714340,,,,,,,,
KKVLPAVIVR,ub,K,74,false,"Arabidopsis ubiquitination COFRADIC",40,26744219,"MaxQuant Score",61.7800000,1.0000000,,,,0.0020000000949949,0.4440000
KKVLPAVIVR,ub,K,75,false,"Arabidopsis ubiquitination COFRADIC",40,26744219,"MaxQuant Score",61.7800000,1.0000000,,,,0.0020000000949949,0.4440000
ECADLWPR,ox,C,125,false,"OxiTRAQ Arabidopsis - 5 mM H2O2 versus control",47,24376095,,,,-0.1969945,0.2531478,NO,,
ECADLWPR,sno,C,125,false,"hot5-4 / wildtype, FAT-switch S-nitrosoproteome",169,37277371,,,,0.3206738,0.0807949,NO,,
GSAITGPIGKECADLWPR,so,C,125,false,"S-sulfenylation site detection using YAP1C",110,32714340,,,,,,,,
