Peptide,PTM,ModifiedAA,ModifiedPosition,PeptideUniqueToGene,ExperimentDesc,ExpID,PubmedID,ScoreType,IdentScore,LocProb,Log2FChange,PQ-val,QuantSig,PEP,MassErrorPPM
ATQPAKESVQCFGR,nt,A,2,true,"N-terminal ChaFRADIC",92,26010716,"MASCOT Score",26.9300000,,,,,3.4690001484705E-5,
ATQPAKESVQCFGR,nt,A,2,true,"Stromal N-terminome",96,26371235,"MASCOT Score",66.8200000,,,,,,
ATQPAKESVQCFGR,nta,A,2,true,"Arg/N-end rule pathway Roots",80,25728785,"MASCOT Score",61.1700000,,,,,2.1690000266972E-6,
ATQPAKESVQCFGR,nta,A,2,true,"N-terminal ChaFRADIC",92,26010716,"MASCOT Score",26.9300000,,,,,3.4690001484705E-5,
ATQPAKESVQCFGR,nta,A,2,true,"Stromal N-terminome",96,26371235,"MASCOT Score",66.8200000,,,,,,
ATQPAKESVQCFGR,nta,A,2,true,"HUNTER N-terminome: legumain, GluC and trypsin",119,31951383,"MaxQuant score",69.9790000,,,,,,
ATQPAKESVQCFGR,nta,A,2,true,"Arabidopsis translation initiation landscape - NTA",167a,35069635,,,,,,,,
ATQPAKESVQCF,nta,A,2,true,"Arg/N-end rule pathway Roots",80,25728785,"MASCOT Score",40.6000000,,,,,0.0074709998443723,
ATQPAKESVQCFGR,so,C,12,true,"S-sulfenylation site detection using YAP1C",110,32714340,,,,,,,,
IFEPVLLLGKHR,ac,K,60,false,"Histone deacetylases - apicidin vs control",98a,29061669,"MaxQuant Score",101.4000000,1.0000000,-0.0600000,0.7943282,NO,0.00036999999429099,
IFEPVLLLGKHR,ac,K,60,false,"Quantitative Acetylproteomics",101,29440448,,,,,,,,
