Peptide,PTM,ModifiedAA,ModifiedPosition,PeptideUniqueToGene,ExperimentDesc,ExpID,PubmedID,ScoreType,IdentScore,LocProb,Log2FChange,PQ-val,QuantSig,PEP,MassErrorPPM
ADKKIRIGIN,nt,A,2,false,"N-term acetylation drought responses",5,26184543,,,,,,,,
ADKKIRIGINGFGR,nta,A,2,false,"HUNTER N-terminome: legumain, GluC and trypsin",119,31951383,"MaxQuant score",83.7690000,,,,,,
ADKKIRIGINGF,nta,A,2,false,"Arabidopsis translation initiation landscape - NTA",167a,35069635,,,,,,,,
ADKKIRIGIN,nta,A,2,false,"N-term acetylation drought responses",5,26184543,,,,,,,,
ADKKIRIGIN,nta,A,2,false,"HUNTER N-terminome: legumain, GluC and trypsin",119,31951383,"MaxQuant score",,,,,,,
IGINGFGR,nt,I,8,false,"Arabidopsis translation initiation landscape - NT",167b,35069635,,,,,,,,
LVAVNDPFITTE,nt,L,32,false,"Arabidopsis translation initiation landscape - NT",167b,35069635,,,,,,,,
VAVNDPFITTE,nt,V,33,false,"Arg/N-end rule seed, prt6 vs. Wt",99,29168982,"MASCOT Score",65.5500000,,-0.3800519,0.2301565,NO,4.42300006398E-6,0.4508852
AVNDPFITTE,nt,A,34,false,"Arg/N-end rule seed, prt6 vs. Wt",99,29168982,"MASCOT Score",59.8400000,,-0.5532473,0.5238550,NO,0.0002698999887798,-0.9325341
YDSVHGQWK,ph,S,53,false,"Tissue atlas Arabidopsis - ProteomicsDB",114,32188942,"MaxQuant score",65.8790000,0.9995100,,,,0.015197799541056,
YDSVHGQWKHNELK,cr,K,59,true,"Open search Plant PTM Viewer 2.0 - Crotonylation",164c,TBA,,,,,,,,
YDSVHGQWKHNELK,pgk,K,59,true,"Open search Plant PTM Viewer 2.0 - 3pgK",164f,TBA,,,,,,,,
HNELKIK,ac,K,64,true,"Quantitative Acetylproteomics",101,29440448,,,,,,,,
DEKTLLFGEKPVTVFGIR,cr,K,69,true,"Open search Plant PTM Viewer 2.0 - Crotonylation",164c,TBA,,,,,,,,
IKDEKTLLFGEKPVTVFGIR,ub,K,69,true,"upl3 mutant / wildtype",168,35926874,"MaxQuant score",72.9900000,0.9980000,0.1826923,,,6.6031898313668E-5,-2.0713000
TLLFGEKPVTVFGIR,nt,T,70,false,"Arabidopsis translation initiation landscape - NT",167b,35069635,,,,,,,,
GEKPVTVFGIRNPE,nt,G,74,false,"Arabidopsis translation initiation landscape - NT",167b,35069635,,,,,,,,
GEKPVTVFGIR,nt,G,74,false,"Stromal N-terminome",96,26371235,"MASCOT Score",38.7300000,,,,,,
GEKPVTVFGIR,nt,G,74,false,"FtsH12 N-terminome: WT / FtsH12 knockdown miRNA",118,33216923,"MaxQuant score",73.9850000,,0.0569775,0.6881042,NO,0.001139699947089,
GEKPVTVFGIR,nt,G,74,false,"HUNTER N-terminome: legumain, GluC and trypsin",119,31951383,"MaxQuant score",98.1560000,,,,,,
EKPVTVFGIRNPE,nt,E,75,false,"Arabidopsis translation initiation landscape - NT",167b,35069635,,,,,,,,
EKPVTVFGIR,nt,E,75,false,"HUNTER N-terminome: legumain, GluC and trypsin",119,31951383,"MaxQuant score",56.3590000,,,,,,
TLLFGEKPVTVFGIR,ac,K,76,false,"Histone deacetylases substrates - TSA vs control",98b,29061669,"MaxQuant Score",98.3000000,1.0000000,-0.0870000,0.9977001,NO,2.9000000317803E-11,
TLLFGEKPVTVFGIR,ac,K,76,false,"Histone deacetylases- hda14 vs WT (low light)",98c,29061669,"MaxQuant Score",218.2000000,1.0000000,-0.5290000,0.9885531,NO,1.0000000458137E-18,
TLLFGEKPVTVFGIR,cr,K,76,false,"Open search Plant PTM Viewer 2.0 - Crotonylation",164c,TBA,,,,,,,,
TLLFGEKPVTVFGIR,hib,K,76,false,"Open search Plant PTM Viewer 2.0 - hib",164e,TBA,,,,,,,,
TLLFGEKPVTVFGIR,ub,K,76,false,"upl3 mutant / wildtype",168,35926874,"MaxQuant score",60.5500000,1.0000000,1.3311319,0.0210990,YES,0.00036343300598674,0.0659820
AGADYVVE,nt,A,94,true,"Arg/N-end rule seed, prt6 vs. Wt",99,29168982,"MASCOT Score",41.4900000,,0.1026749,0.3304966,NO,0.010400000028312,-1.0467541
STGVFTDKD,nt,S,102,false,"Arg/N-end rule seed, prt6 vs. Wt",99,29168982,"MASCOT Score",45.4400000,,0.0931948,0.5726685,NO,1.2739999988298E-7,-1.5595756
KVVISAPSKDAPMFVVGVNEHEYK,ac,K,130,false,"Lysine acetylation gel-based Finkemeier et al",37,21311031,i-probability,0.9999940,,,,,,
VVISAPSKDAPMFVVGVNEHEYK,ac,K,130,false,"Histone deacetylases- hda14 vs WT (low light)",98c,29061669,"MaxQuant Score",193.3900000,1.0000000,-0.4770000,0.9885531,NO,3.2999999165755E-25,
VVISAPSKDAPMFVVGVNEHEYK,ub,K,130,false,"upl3 mutant / wildtype",168,35926874,"MaxQuant score",118.5900000,1.0000000,-1.3364277,0.1203800,NO,5.6157498581378E-18,-0.2778100
DAPMFVVGVNEHEYKS,nt,D,131,false,"Arabidopsis translation initiation landscape - NT",167b,35069635,,,,,,,,
DAPMFVVGVNEHEYK,mox,M,134,false,"cat2 Methionine oxidation - 1h stress",62a,25693801,"MASCOT Score",61.0000000,,0.0151642,,NO,,
EHEYKSDLDIVSN,nt,E,141,false,"HUNTER N-terminome: legumain, GluC and trypsin",119,31951383,"MaxQuant score",103.9100000,,,,,,
DAPMFVVGVNEHEYKSDLDIVSNASCTTNCLAPLAK,ub,K,145,false,"Arabidopsis ubiquitination by TUBEs",2,23667124,,,,,,,,
SDLDIVSNASCTTNCLAPLAKVINDR,nt,S,146,false,"Arabidopsis translation initiation landscape - NT",167b,35069635,,,,,,,,
SDLDIVSNASCTTNCLAPLAK,ph,S,155,false,"SnRK2 protein kinase substrates",85,23776212,XCorr,3.9496937,0.9540000,,,,9.9281094456671E-10,
SDLDIVSNASCTTNCLAPLAK,ph,S,155,false,"Lateral root-induction - NAA vs control",106,23328941,"MASCOT Score",36.0000000,,,,,,
SDLDIVSNASCTTNCLAPLAK,ph,S,155,false,"Tissue atlas Arabidopsis - ProteomicsDB",114,32188942,"MaxQuant score",233.3800000,0.9831280,,,,0,
SDLDIVSNASCTTNCLAPLAK,ox,C,156,false,"SPEAR - 10 mM H2O2 / mock",138a,34619326,,,,-2.2033672,0.0127786,YES,,
SDLDIVSNASCTTNCLAPLAK,sno,C,156,false,"Site-specific nitrosomeproteomic id - gsnor1-3",90a,25699590,XCorr,3.6200000,,,,,0.047260001301765,-6.6900000
SDLDIVSNASCTTNCLAPLAK,sno,C,156,false,"Site-specific nitrosomeproteomic id - gsnor1-3",90b,25699590,XCorr,4.6900000,,,,,0.026159999892116,-6.5000000
SDLDIVSNASCTTNCLAPLAK,so,C,156,false,"Arabidopsis S-sulfenylation chemoproteomics",108,31578252,"pFind PSM Score",0.0022364,,,,,,0.7575103
SDLDIVSNASCTTNCLAPLAK,ph,T,157,false,"Large-scale phosphorylation discovery",44,23111157,XCorr,3.9660000,,,,,,
SDLDIVSNASCTTNCLAPLAK,ph,T,157,false,"Lateral root-induction - NAA vs control",106,23328941,"MASCOT Score",26.0000000,,,,,,
SDLDIVSNASCTTNCLAPLAK,ph,T,157,false,"Tissue atlas Arabidopsis - ProteomicsDB",114,32188942,"MaxQuant score",161.5100000,0.8329440,,,,2.1054199948199E-29,
CLAPLAKVINDRFGIVE,nt,C,160,false,"Arabidopsis translation initiation landscape - NT",167b,35069635,,,,,,,,
SDLDIVSNASCTTNCLAPLAK,sno,C,160,false,"Site-specific nitrosomeproteomic id - gsnor1-3",90b,25699590,XCorr,4.1400000,,,,,0.0023040000814945,-8.0100000
SDLDIVSNASCTTNCLAPLAK,so,C,160,false,"Arabidopsis S-sulfenylation chemoproteomics",108,31578252,"pFind PSM Score",0.0022364,,1.3513500,,,,0.7575103
SDLDIVSNASCTTNCLAPLAK,so,C,160,false,"S-sulfenylation site detection using YAP1C",110,32714340,,,,,,,,
GLMTTVHSITATQKTVDGPSMKD,nt,G,177,false,"Arabidopsis translation initiation landscape - NT",167b,35069635,,,,,,,,
FGIVEGLMTTVHSITATQK,ph,T,188,false,"Large-scale phosphorylation discovery",44,23111157,XCorr,3.9500000,,,,,,
FGIVEGLMTTVHSITATQK,ph,T,188,false,"PAMP-triggered phosphorylation",48,24601666,"MASCOT Score",66.3100000,,,,,,
FGIVEGLMTTVHSITATQK,ph,T,188,false,"Tissue atlas Arabidopsis - ProteomicsDB",114,32188942,"MaxQuant score",290.5200000,0.9999850,,,,0,
FGIVEGLMTTVHSITATQKTVDGPSMK,ub,K,190,false,"upl3 mutant / wildtype",168,35926874,"MaxQuant score",134.1500000,1.0000000,-0.9050884,,,1.5723899735393E-25,-2.7026000
TVDGPSMKDWR,ph,S,196,false,"Phospho cell culture sucrose/TOR",109,30833711,,,0.9999990,,,,,
TVDGPSMKDWR,ph,S,196,false,"Tissue atlas Arabidopsis - ProteomicsDB",114,32188942,"MaxQuant score",131.3600000,1.0000000,,,,6.6395400608599E-6,
TVDGPSMK,ph,S,196,false,"atm and atr DNA damage response",88,25561503,"MASCOT Score",44.0000000,1.0000000,,,,,-1.0500000
TVDGPSMK,mox,M,197,false,"cat2 Methionine oxidation - 1h stress",62a,25693801,"MASCOT Score",41.0000000,,0.0764323,,NO,,
TVDGPSMKDWR,ac,K,198,false,"Histone deacetylases - apicidin vs control",98a,29061669,"MaxQuant Score",136.4000000,1.0000000,0.0220000,0.8933055,NO,9.2999996592624E-11,
TVDGPSMKDWR,ac,K,198,false,"Histone deacetylases substrates - TSA vs control",98b,29061669,"MaxQuant Score",136.4000000,1.0000000,0.0850000,0.9977001,NO,9.2999996592624E-11,
TVDGPSMKDWR,ac,K,198,false,"Histone deacetylases- hda14 vs WT (low light)",98c,29061669,"MaxQuant Score",257.5400000,1.0000000,-0.1210000,0.9885531,NO,1.6999999848255E-18,
TVDGPSMKDWR,ac,K,198,false,"Histone deacetylases substrates - hda14 vs WT",98e,29061669,"MaxQuant Score",54.0000000,1.0000000,-0.0810000,0.9183326,NO,0.0040000001899898,
TVDGPSMKDWR,ac,K,198,false,"Quantitative Acetylproteomics",101,29440448,,,,,,,,
TVDGPSMKDWR,pgk,K,198,false,"Open search Plant PTM Viewer 2.0 - 3pgK",164f,TBA,,,,,,,,
TVDGPSMKDWR,ub,K,198,false,"upl3 mutant / wildtype",168,35926874,"MaxQuant score",94.7670000,1.0000000,0.9553128,0.1813640,NO,0.00019335700199008,0.5307000
AASFNIIPSSTGAAK,ph,S,207,false,"Arabidopsis root NAA phosphoproteome",18a,27643528,"MaxQuant Score",47.0880000,1.0000000,,,,0.0007317999843508,0.4580000
AASFNIIPSSTGAAK,ph,S,207,false,"PAMP-triggered phosphorylation",48,24601666,"MASCOT Score",30.0500000,,,,,,
AASFNIIPSSTGAAK,ph,S,207,false,"BSK8 and BSL2 regulating sucrose-ph synthase",66,24924143,"MaxQuant Score",150.6800000,,,,,,0.7177500
AASFNIIPSSTGAAK,ph,S,207,false,"srk2dei ABA signaling phopshoproteomics",83,23572148,"MASCOT Score",26.0000000,,,,,,-0.0009000
AASFNIIPSSTGAAK,ph,S,207,false,"LAXIC - ABA stress",84a,23660473,XCorr,3.3400000,1.0000000,,,,0.00036958500277251,
AASFNIIPSSTGAAK,ph,S,207,false,"LAXIC - mannitol vs control",84b,23660473,XCorr,3.2700000,1.0000000,,,,0.035845398902893,
AASFNIIPSSTGAAK,ph,S,207,false,"SnRK2 protein kinase substrates",85,23776212,XCorr,3.4268343,1.0000000,,,,3.96250006599E-16,
AASFNIIPSSTGAAK,ph,S,207,false,"atm and atr DNA damage response",88,25561503,"MASCOT Score",90.0000000,1.0000000,,,,,-1.2200000
AASFNIIPSSTGAAK,ph,S,207,false,"Lateral root-induction - NAA vs control",106,23328941,"MASCOT Score",40.0000000,,,,,,
AASFNIIPSSTGAAK,ph,S,207,false,"Phospho cell culture sucrose/TOR",109,30833711,,,1.0000000,,,,,
AASFNIIPSSTGAAK,ph,S,207,false,"Col-0 callus - FC Col-0 vs. Col-0 Xray",111a,31410901,,31.6100000,,0.7873935,0.0388634,YES,,0.7522098
AASFNIIPSSTGAAK,ph,S,207,false,"Col-0 X-ray callus - FC Col-0 vs. Col-0 Xray",111b,31410901,,31.6100000,,0.7873935,0.0388634,YES,,0.7522098
AASFNIIPSSTGAAK,ph,S,207,false,"atm callus - FC atm vs. atm Xray",111c,31410901,,31.6100000,,0.4024503,0.3901200,NO,,0.7522098
AASFNIIPSSTGAAK,ph,S,207,false,"atm-3 X-ray callus - FC atm vs. atm Xray",111d,31410901,,31.6100000,,0.4024503,0.3901200,NO,,0.7522098
AASFNIIPSSTGAAK,ph,S,207,false,"Tissue atlas Arabidopsis - ProteomicsDB",114,32188942,"MaxQuant score",179.5500000,1.0000000,,,,1.0452400223331E-29,
AASFNIIPSSTGAAK,ph,S,207,false,"Touch-induced phosphorylation: 40s touch vs untouc",136,30291188,"MASCOT score",77.8600000,,0.7246835,0.1317563,NO,,4.1131398
AASFNIIPSSTGAAK,ph,S,213,false,"TOR Kinase and ABA Receptor",100,29290610,XCorr,4.7485065,0.9000000,,,,4.1060000512516E-5,
AASFNIIPSSTGAAK,ph,S,213,false,"Lateral root-induction - NAA vs control",106,23328941,"MASCOT Score",29.0000000,,,,,,
AASFNIIPSSTGAAK,ph,S,214,false,"srk2dei ABA signaling phopshoproteomics",83,23572148,"MASCOT Score",47.0000000,,,,,,-0.0006000
AASFNIIPSSTGAAK,ph,T,215,false,"srk2dei ABA signaling phopshoproteomics",83,23572148,"MASCOT Score",35.0000000,,,,,,0.0006000
AASFNIIPSSTGAAK,ph,T,215,false,"atm and atr DNA damage response",88,25561503,"MASCOT Score",43.0000000,0.9930000,,,,,-0.2000000
AASFNIIPSSTGAAKAVGK,ac,K,219,false,"Lysine acetylation gel-based Finkemeier et al",37,21311031,i-probability,1.0000000,,,,,,
AASFNIIPSSTGAAKAVGK,cr,K,219,false,"Open search Plant PTM Viewer 2.0 - Crotonylation",164c,TBA,,,,,,,,
AASFNIIPSSTGAAKAVGK,hib,K,219,false,"Open search Plant PTM Viewer 2.0 - hib",164e,TBA,,,,,,,,
AASFNIIPSSTGAAKAVGK,pgk,K,219,false,"Open search Plant PTM Viewer 2.0 - 3pgK",164f,TBA,,,,,,,,
AASFNIIPSSTGAAKAVGK,ub,K,219,false,"Ubiquitination Membrane Proteins",120,33585938,,,,,,,,
AASFNIIPSSTGAAKAVGK,ub,K,219,false,"upl3 mutant / wildtype",168,35926874,"MaxQuant score",120.9000000,1.0000000,1.0517201,0.2094800,NO,2.0630099191454E-12,-0.1698700
AVGKVLPALNGK,pgk,K,223,true,"Open search Plant PTM Viewer 2.0 - 3pgK",164f,TBA,,,,,,,,
VLPALNGKLTGMSFR,cr,K,231,true,"Open search Plant PTM Viewer 2.0 - Crotonylation",164c,TBA,,,,,,,,
SFRVPTVDVSVVDLTVR,nt,S,236,false,"Arg/N-end rule pathway Roots",80,25728785,"MASCOT Score",31.1100000,,,,,0.0020930001046509,
LTGMSFRVPTVDVSVVDLTVR,ph,S,236,false,"TOR Kinase and ABA Receptor",100,29290610,XCorr,4.7799315,0.9993000,,,,1.7579999678219E-8,
LTGMSFR,ph,S,236,false,"Arabidopsis root NAA phosphoproteome",18a,27643528,"MaxQuant Score",72.5640000,1.0000000,,,,5.3800000898718E-8,0.0490000
LTGMSFR,ph,S,236,false,"PAMP-triggered phosphorylation",48,24601666,"MASCOT Score",47.1000000,,,,,,
LTGMSFR,ph,S,236,false,"srk2dei ABA signaling phopshoproteomics",83,23572148,"MASCOT Score",28.0000000,,,,,,0.0004000
LTGMSFR,ph,S,236,false,"SnRK2 protein kinase substrates",85,23776212,XCorr,2.0283298,1.0000000,,,,0.072476401925087,
LTGMSFR,ph,S,236,false,"TOR Kinase and ABA Receptor",100,29290610,XCorr,2.2474344,1.0000000,,,,0.013519999571145,
LTGMSFR,ph,S,236,false,"Lateral root-induction - NAA vs control",106,23328941,"MASCOT Score",38.0000000,,,,,,
LTGMSFR,ph,S,236,false,"Phospho cell culture sucrose/TOR",109,30833711,,,0.9999610,,,,,
LTGMSFR,ph,S,236,false,"Tissue atlas Arabidopsis - ProteomicsDB",114,32188942,"MaxQuant score",161.9400000,1.0000000,,,,1.1179799889202E-29,
DVSVVDLTVR,nt,D,243,false,"Arg/N-end rule seed, prt6 vs. Wt",99,29168982,"MASCOT Score",34.5100000,,-0.0327069,0.7700335,NO,0.090279996395111,-2.7590743
LEKAATYDEIKK,ac,K,255,false,"Lysine acetylation gel-based Finkemeier et al",37,21311031,i-probability,0.9932440,,,,,,
LEKAATYDEIK,ac,K,255,false,"Histone deacetylases - apicidin vs control",98a,29061669,"MaxQuant Score",52.6000000,1.0000000,0.1090000,0.6854882,NO,0.0080000003799796,
LEKAATYDEIKK,cr,K,255,false,"Open search Plant PTM Viewer 2.0 - Crotonylation",164c,TBA,,,,,,,,
LEKAATYDEIK,cr,K,255,false,"Open search Plant PTM Viewer 2.0 - Crotonylation",164c,TBA,,,,,,,,
LEKAATYDEIKK,hib,K,255,false,"Open search Plant PTM Viewer 2.0 - hib",164e,TBA,,,,,,,,
LEKAATYDEIKK,pgk,K,255,false,"Open search Plant PTM Viewer 2.0 - 3pgK",164f,TBA,,,,,,,,
LEKAATYDEIKK,ub,K,255,false,"upl3 mutant / wildtype",168,35926874,"MaxQuant score",196.1100000,1.0000000,0.5310695,0.4244000,NO,2.8422398994632E-17,0.2324500
AATYDEIKK,ph,T,258,false,"atm and atr DNA damage response",88,25561503,"MASCOT Score",33.0000000,1.0000000,,,,,-1.7200000
AATYDEIKK,ph,T,258,false,"Tissue atlas Arabidopsis - ProteomicsDB",114,32188942,"MaxQuant score",111.3300000,0.9999960,,,,0.001173079945147,
AATYDEIKK,ac,K,263,false,"Histone deacetylases - apicidin vs control",98a,29061669,"MaxQuant Score",117.0000000,1.0000000,0.0030000,0.9840111,NO,0.0099999997764826,
AATYDEIKK,ac,K,263,false,"Histone deacetylases substrates - TSA vs control",98b,29061669,"MaxQuant Score",117.0000000,1.0000000,0.1100000,0.9977001,NO,0.0099999997764826,
AATYDEIKK,ac,K,263,false,"Histone deacetylases- hda14 vs WT (low light)",98c,29061669,"MaxQuant Score",127.7600000,1.0000000,0.1480000,0.9885531,NO,0.0089999996125698,
AATYDEIKK,ac,K,263,false,"Histone deacetylases substrates - hda14 vs WT",98e,29061669,"MaxQuant Score",86.9000000,1.0000000,-0.0380000,0.9660509,NO,0.003000000026077,
AATYDEIKK,ac,K,263,false,"Quantitative Acetylproteomics",101,29440448,,,,,,,,
AATYDEIKK,ub,K,263,false,"Ubiquitination Membrane Proteins",120,33585938,,,,,,,,
AIKEESEGK,ac,K,267,false,"Histone deacetylases - apicidin vs control",98a,29061669,"MaxQuant Score",125.7000000,1.0000000,0.1010000,0.5610480,NO,0.0060000000521541,
EESEGKLKGILGYTE,nt,E,268,true,"Arabidopsis translation initiation landscape - NT",167b,35069635,,,,,,,,
GKLKGILGYTE,nt,G,272,true,"Arabidopsis translation initiation landscape - NT",167b,35069635,,,,,,,,
AIKEESEGKLK,ac,K,273,true,"Quantitative Acetylproteomics",101,29440448,,,,,,,,
EESEGKLK,ac,K,273,true,"Quantitative Acetylproteomics",101,29440448,,,,,,,,
AIKEESEGKLK,ub,K,273,true,"Ubiquitination Membrane Proteins",120,33585938,,,,,,,,
AIKEESEGKLK,ub,K,273,true,"upl3 mutant / wildtype",168,35926874,"MaxQuant score",176.1800000,1.0000000,0.5607150,0.2230600,NO,4.3453400599969E-11,-0.1892400
LKGILGYTEDDVVSTDFVGDNR,nt,L,274,true,"Arabidopsis translation initiation landscape - NT",167b,35069635,,,,,,,,
GILGYTEDDVVSTDFVGDNR,nt,G,276,false,"Arg/N-end rule seed, prt6 vs. Wt",99,29168982,"MASCOT Score",72.0300000,,-0.5261086,0.4441859,NO,2.107000000251E-5,-2.0376838
GILGYTEDDVVSTDFVGDNR,nt,G,276,false,"Arabidopsis translation initiation landscape - NT",167b,35069635,,,,,,,,
GYTEDDVVSTDFVGDNR,nt,G,279,false,"Arg/N-end rule seed, prt6 vs. Wt",99,29168982,"MASCOT Score",81.2900000,,-1.1065686,0.1317882,NO,8.106000314001E-5,-1.4579911
YTEDDVVSTDFVGDNR,nt,Y,280,false,"Arg/N-end rule seed, prt6 vs. Wt",99,29168982,"MASCOT Score",79.8600000,,-0.3004399,0.4740962,NO,0.00025049998657778,-1.5645350
YTEDDVVSTDFVGDNR,nta,Y,280,false,"FtsH12 N-terminome: WT / FtsH12 knockdown miRNA",118,33216923,"MaxQuant score",75.8490000,,,,,0.014960000291467,
TEDDVVSTDFVGDNR,nt,T,281,false,"Arg/N-end rule seed, prt6 vs. Wt",99,29168982,"MASCOT Score",37.2000000,,0.0710016,0.5760687,NO,0.04424000158906,-2.6497558
TEDDVVSTDFVGDNR,nt,T,281,false,"FtsH12 N-terminome: WT / FtsH12 knockdown miRNA",118,33216923,"MaxQuant score",64.6500000,,0.0420783,0.7749686,NO,0.002089099958539,
EDDVVSTDFVGDNR,nt,E,282,false,"Arg/N-end rule seed, prt6 vs. Wt",99,29168982,"MASCOT Score",28.5700000,,,,,0.15090000629425,-2.4866315
SSIFDAKAGIALSDK,cr,K,302,false,"Open search Plant PTM Viewer 2.0 - Crotonylation",164c,TBA,,,,,,,,
SSIFDAKAGIALSDK,ub,K,302,false,"upl3 mutant / wildtype",168,35926874,"MaxQuant score",97.0730000,1.0000000,0.5558162,0.5404200,NO,4.2481201489863E-6,-0.8067900
AGIALSDKFVK,ph,S,308,false,"atm and atr DNA damage response",88,25561503,"MASCOT Score",29.0000000,1.0000000,,,,,-1.4300000
AGIALSDKFVK,ph,S,308,false,"Tissue atlas Arabidopsis - ProteomicsDB",114,32188942,"MaxQuant score",115.0600000,1.0000000,,,,0.00016863200289663,
AGIALSDK,ph,S,308,false,"atm and atr DNA damage response",88,25561503,"MASCOT Score",29.0000000,1.0000000,,,,,-1.5800000
AGIALSDK,ph,S,308,false,"TOR Kinase and ABA Receptor",100,29290610,XCorr,2.9491284,1.0000000,,,,0.011140000075102,
AGIALSDKFVK,ac,K,310,false,"Histone deacetylases - apicidin vs control",98a,29061669,"MaxQuant Score",131.2000000,1.0000000,0.0510000,0.8109611,NO,2.500000042156E-17,
AGIALSDKFVK,ac,K,310,false,"Histone deacetylases substrates - TSA vs control",98b,29061669,"MaxQuant Score",131.2000000,1.0000000,0.0820000,0.9977001,NO,2.500000042156E-17,
AGIALSDKFVK,ac,K,310,false,"Histone deacetylases - hda14 vs WT (thylakoids)",98d,29061669,"MaxQuant Score",74.6000000,1.0000000,-0.8150000,0.5128614,NO,0.003000000026077,
AGIALSDKFVK,ac,K,310,false,"Histone deacetylases substrates - hda14 vs WT",98e,29061669,"MaxQuant Score",84.5000000,1.0000000,0.1320000,0.9078205,NO,3.1999999919208E-5,
AGIALSDKFVK,ac,K,310,false,"Quantitative Acetylproteomics",101,29440448,,,,,,,,
AGIALSDKFVK,cr,K,310,false,"Open search Plant PTM Viewer 2.0 - Crotonylation",164c,TBA,,,,,,,,
AGIALSDKFVK,pgk,K,310,false,"Open search Plant PTM Viewer 2.0 - 3pgK",164f,TBA,,,,,,,,
SSRVVDLIVHMSKA,nt,S,325,false,"Arabidopsis translation initiation landscape - NT",167b,35069635,,,,,,,,
VVDLIVHMSKA,ac,K,337,false,"Quantitative Acetylproteomics",101,29440448,,,,,,,,
