Peptide,PTM,ModifiedAA,ModifiedPosition,PeptideUniqueToGene,ExperimentDesc,ExpID,PubmedID,ScoreType,IdentScore,LocProb,Log2FChange,PQ-val,QuantSig,PEP,MassErrorPPM
AAASSVSSPPLCLAGR,nt,A,2,true,"Arg/N-end rule seed, prt6 vs. Wt",99,29168982,"MASCOT Score",63.3200000,,,,,0.0018680000212044,-1.9305685
AAASSVSSPPLCLAGR,nta,A,2,true,"Arg/N-end rule seed, prt6 vs. Wt",99,29168982,"MASCOT Score",63.3200000,,,,,0.0018680000212044,-1.9305685
AAASSVSSPPLCLAGR,nta,A,2,true,"HUNTER N-terminome: legumain, GluC and trypsin",119,31951383,"MaxQuant score",67.3850000,,,,,,
AAASSVSSPPLCLAGR,nta,A,2,true,"Arabidopsis translation initiation landscape - NTA",167a,35069635,,,,,,,,
VATAITTNCSK,ox,C,65,true,"SPEAR - 50 mM H2O2 / mock",138b,34619326,,,,5.4797012,0.0469913,YES,,
VATAITTNCSK,sno,C,65,true,"Site-specific nitrosomeproteomic id - gsnor1-3",90b,25699590,XCorr,2.5300000,,,,,0.29570001363754,-6.7000000
VSPGPVATE,nt,V,207,false,"Arg/N-end rule seed, prt6 vs. Wt",99,29168982,"MASCOT Score",42.0200000,,-0.3921607,0.1130202,NO,0.019840000197291,1.3476799
VKSQNLFGR,ph,S,231,true,"Tissue atlas Arabidopsis - ProteomicsDB",114,32188942,"MaxQuant score",84.6580000,1.0000000,,,,0.005966970231384,
