Peptide,PTM,ModifiedAA,ModifiedPosition,PeptideUniqueToGene,ExperimentDesc,ExpID,PubmedID,ScoreType,IdentScore,LocProb,Log2FChange,PQ-val,QuantSig,PEP,MassErrorPPM
STHSSISQPPLPLAGRVAIVTG,nt,S,2,true,"Arg/N-end rule seed, prt6 vs. Wt",99,29168982,"MASCOT Score",27.5500000,,,,,2.0829999414218E-7,-3.2917011
STHSSISQPPLPLAGR,nt,S,2,true,"Tic56 chloroplast import - ppi2",89b,25588737,XCorr,4.6287050,,,,,,
STHSSISQPPLPLAGR,nt,S,2,true,"Tic56 chloroplast import - tic56-1",89c,25588737,XCorr,4.2208681,,,,,,
STHSSISQPPLPLAGR,nt,S,2,true,"Stromal N-terminome",96,26371235,"MASCOT Score",74.4400000,,,,,,
STHSSISQPPLPLAGR,nt,S,2,true,"Arg/N-end rule seed, prt6 vs. Wt",99,29168982,"MASCOT Score",50.1400000,,,,,0.0057609998621047,-0.4608974
STHSSISQPPLPL,nt,S,2,true,"Arg/N-end rule seed, prt6 vs. Wt",99,29168982,"MASCOT Score",49.6000000,,,,,0.065200001001358,-1.4698142
STHSSISQPPLPLAGRVAIVTG,nta,S,2,true,"Arg/N-end rule seed, prt6 vs. Wt",99,29168982,"MASCOT Score",27.5500000,,,,,2.0829999414218E-7,-3.2917011
STHSSISQPPLPLAGR,nta,S,2,true,"Arg/N-end rule pathway Roots",80,25728785,"MASCOT Score",62.0900000,,,,,2.3000000510365E-5,
STHSSISQPPLPLAGR,nta,S,2,true,"Tic56 chloroplast import - ppi2",89b,25588737,XCorr,4.6287050,,,,,,
STHSSISQPPLPLAGR,nta,S,2,true,"Tic56 chloroplast import - tic56-1",89c,25588737,XCorr,4.2208681,,,,,,
STHSSISQPPLPLAGR,nta,S,2,true,"Stromal N-terminome",96,26371235,"MASCOT Score",74.4400000,,,,,,
STHSSISQPPLPLAGR,nta,S,2,true,"Arg/N-end rule seed, prt6 vs. Wt",99,29168982,"MASCOT Score",50.1400000,,,,,0.0057609998621047,-0.4608974
STHSSISQPPLPLAGR,nta,S,2,true,"FtsH12 N-terminome: WT / FtsH12 knockdown miRNA",118,33216923,"MaxQuant score",60.2550000,,,,,6.4999999706392E-15,
STHSSISQPPLPLAGR,nta,S,2,true,"HUNTER N-terminome: legumain, GluC and trypsin",119,31951383,"MaxQuant score",194.2900000,,,,,,
STHSSISQPPLPLAGR,nta,S,2,true,"Arabidopsis translation initiation landscape - NTA",167a,35069635,,,,,,,,
STHSSISQPPLPL,nta,S,2,true,"Arg/N-end rule seed, prt6 vs. Wt",99,29168982,"MASCOT Score",49.6000000,,,,,0.065200001001358,-1.4698142
STHSSISQPPLPLAGR,ph,S,2,true,"Tissue atlas Arabidopsis - ProteomicsDB",114,32188942,"MaxQuant score",296.9100000,0.9627920,,,,0,
STHSSISQPPLPLAGR,ph,T,3,true,"atm and atr DNA damage response",88,25561503,"MASCOT Score",72.0000000,0.9430000,,,,,-0.4500000
STHSSISQPPLPLAGR,ph,T,3,true,"Tissue atlas Arabidopsis - ProteomicsDB",114,32188942,"MaxQuant score",254.5600000,0.8393490,,,,0,
STHSSISQPPLPLAGR,ph,S,5,true,"atm and atr DNA damage response",88,25561503,"MASCOT Score",65.0000000,0.8690000,,,,,-0.7200000
STHSSISQPPLPLAGR,ph,S,5,true,"Tissue atlas Arabidopsis - ProteomicsDB",114,32188942,"MaxQuant score",197.2900000,0.9679600,,,,1.9624300269071E-36,
GAFLCSK,ox,C,144,true,"OxiTRAQ Arabidopsis - 5 mM H2O2 versus control",47,24376095,,,,-0.0581517,0.0529439,NO,,
