Peptide,PTM,ModifiedAA,ModifiedPosition,PeptideUniqueToGene,ExperimentDesc,ExpID,PubmedID,ScoreType,IdentScore,LocProb,Log2FChange,PQ-val,QuantSig,PEP,MassErrorPPM
MELSVSPQTQK,ph,S,6,true,"atm and atr DNA damage response",88,25561503,"MASCOT Score",61.0000000,0.9460000,,,,,0.2100000
MELSVSPQTQK,ph,S,6,true,"Tissue atlas Arabidopsis - ProteomicsDB",114,32188942,"MaxQuant score",184.3400000,0.9961430,,,,7.8528704060819E-15,
SSETWSSRPLPTPTATFPVVIDSEEEESESDILR,ph,S,663,true,"TOR Kinase and ABA Receptor",100,29290610,XCorr,5.7343683,0.9839000,,,,9.3629998445977E-5,
HFSSIGGTR,ph,S,685,true,"Tissue atlas Arabidopsis - ProteomicsDB",114,32188942,"MaxQuant score",67.3340000,0.8164910,,,,0.013293200172484,
KDNPPDSPR,ph,S,856,true,"atm and atr DNA damage response",88,25561503,"MASCOT Score",41.0000000,1.0000000,,,,,-2.0500000
KDNPPDSPR,ph,S,856,true,"Tissue atlas Arabidopsis - ProteomicsDB",114,32188942,"MaxQuant score",147.3300000,1.0000000,,,,0.00010276000102749,
DNPPDSPR,ph,S,856,true,"atm and atr DNA damage response",88,25561503,"MASCOT Score",45.0000000,1.0000000,,,,,-0.2100000
NQSGDDSPGKSEGK,ph,S,944,true,"atm and atr DNA damage response",88,25561503,"MASCOT Score",41.0000000,1.0000000,,,,,-1.5600000
SLQQSDVEKGTPPWASSETPR,ph,T,980,true,"Tissue atlas Arabidopsis - ProteomicsDB",114,32188942,"MaxQuant score",143.0800000,0.9992720,,,,3.7711399431668E-25,
KQQSLSHSPK,ph,S,1014,true,"Tissue atlas Arabidopsis - ProteomicsDB",114,32188942,"MaxQuant score",80.2450000,0.9938690,,,,0.0045679300092161,
QQSLSHSPK,ph,S,1014,true,"atm and atr DNA damage response",88,25561503,"MASCOT Score",31.0000000,1.0000000,,,,,-0.8700000
TSGFTVATGQGSPSDSPGTNR,ph,S,1030,true,"Conserved plant phosphoproteome - Arabidopsis",61a,20466843,"MASCOT Score",26.0000000,1.0000000,,,,,
TSGFTVATGQGSPSDSPGTNR,ph,S,1030,true,"atm and atr DNA damage response",88,25561503,"MASCOT Score",60.0000000,1.0000000,,,,,0.0300000
TSGFTVATGQGSPSDSPGTNR,ph,S,1030,true,"Tissue atlas Arabidopsis - ProteomicsDB",114,32188942,"MaxQuant score",263.9000000,0.9996800,,,,0,
