Peptide,PTM,ModifiedAA,ModifiedPosition,PeptideUniqueToGene,ExperimentDesc,ExpID,PubmedID,ScoreType,IdentScore,LocProb,Log2FChange,PQ-val,QuantSig,PEP,MassErrorPPM
EHCPSLQSELLK,sno,C,376,true,"hot5-4 / wildtype, FAT-switch S-nitrosoproteome",169,37277371,,,,,,,,
TVAGCEEELSGGGGK,ph,S,395,true,"atm and atr DNA damage response",88,25561503,"MASCOT Score",72.0000000,1.0000000,,,,,-0.4800000
TVAGCEEELSGGGGK,ph,S,395,true,"TOR Kinase and ABA Receptor",100,29290610,XCorr,3.1470795,1.0000000,,,,0.0045449999161065,
TVAGCEEELSGGGGK,ph,S,395,true,"Lateral root-induction - NAA vs control",106,23328941,"MASCOT Score",29.0000000,,,,,,
TVAGCEEELSGGGGK,ph,S,395,true,"Col-0 callus - FC Col-0 vs. Col-0 Xray",111a,31410901,,50.7000000,,0.9972119,0.0000000,NO,,0.3637444
TVAGCEEELSGGGGK,ph,S,395,true,"Col-0 X-ray callus - FC Col-0 vs. Col-0 Xray",111b,31410901,,50.7000000,,0.9972119,0.0000000,NO,,0.3637444
TVAGCEEELSGGGGK,ph,S,395,true,"atm callus - FC atm vs. atm Xray",111c,31410901,,50.7000000,,0.4410713,0.0000000,NO,,0.3637444
TVAGCEEELSGGGGK,ph,S,395,true,"atm-3 X-ray callus - FC atm vs. atm Xray",111d,31410901,,50.7000000,,0.4410713,0.0000000,NO,,0.3637444
TVAGCEEELSGGGGK,ph,S,395,true,"Tissue atlas Arabidopsis - ProteomicsDB",114,32188942,"MaxQuant score",209.6600000,1.0000000,,,,1.4012984643248E-45,
SVWGQFSDGGAETNGR,ph,S,409,true,"Tissue atlas Arabidopsis - ProteomicsDB",114,32188942,"MaxQuant score",145.4300000,0.9997650,,,,7.0971301058265E-10,
NNNDNNNSDDPMAELED,ph,S,456,true,"atm and atr DNA damage response",88,25561503,"MASCOT Score",41.0000000,1.0000000,,,,,-0.9400000
