Peptide,PTM,ModifiedAA,ModifiedPosition,PeptideUniqueToGene,ExperimentDesc,ExpID,PubmedID,ScoreType,IdentScore,LocProb,Log2FChange,PQ-val,QuantSig,PEP,MassErrorPPM
DVDADADEGVNSPSSFPNSPDDSDRR,ph,S,35,true,"Tissue atlas Arabidopsis - ProteomicsDB",114,32188942,"MaxQuant score",266.6700000,0.8383800,,,,0,
SQSFTTLAEALTVEDLAKPENPFNAK,ph,S,67,true,"Col-0 callus - FC Col-0 vs. Col-0 Xray",111a,31410901,,35.2500000,,-0.5300172,0.0000000,NO,,0.7559839
SQSFTTLAEALTVEDLAKPENPFNAK,ph,S,67,true,"Col-0 X-ray callus - FC Col-0 vs. Col-0 Xray",111b,31410901,,35.2500000,,-0.5300172,0.0000000,NO,,0.7559839
SQSFTTLAEALTVEDLAKPENPFNAK,ph,S,67,true,"atm callus - FC atm vs. atm Xray",111c,31410901,,35.2500000,,0.3975024,0.0000000,NO,,0.7559839
SQSFTTLAEALTVEDLAKPENPFNAK,ph,S,67,true,"atm-3 X-ray callus - FC atm vs. atm Xray",111d,31410901,,35.2500000,,0.3975024,0.0000000,NO,,0.7559839
RLSGCGGASER,ph,S,106,true,"Tissue atlas Arabidopsis - ProteomicsDB",114,32188942,"MaxQuant score",59.2940000,1.0000000,,,,0.0076130297966301,
RLSGCGGASER,ph,S,112,true,"Tissue atlas Arabidopsis - ProteomicsDB",114,32188942,"MaxQuant score",131.0600000,1.0000000,,,,2.6807600079337E-5,
NLSVHDVFLAGNDRPPR,ph,S,117,true,"Tissue atlas Arabidopsis - ProteomicsDB",114,32188942,"MaxQuant score",75.0640000,1.0000000,,,,0.00010499200288905,
AQTLSAAHISALLTR,ph,T,143,true,"TOR Kinase and ABA Receptor",100,29290610,XCorr,2.8208883,0.9998000,,,,4.4950002120459E-6,
AQTLSAAHISALLTR,ph,T,143,true,"Tissue atlas Arabidopsis - ProteomicsDB",114,32188942,"MaxQuant score",211.4000000,0.9999990,,,,2.8025969286496E-45,
AQTLSAAHISALLTR,ph,S,145,true,"Tissue atlas Arabidopsis - ProteomicsDB",114,32188942,"MaxQuant score",181.4000000,0.9999380,,,,4.4680499886801E-25,
