Peptide,PTM,ModifiedAA,ModifiedPosition,PeptideUniqueToGene,ExperimentDesc,ExpID,PubmedID,ScoreType,IdentScore,LocProb,Log2FChange,PQ-val,QuantSig,PEP,MassErrorPPM
DLESDRR,nt,D,25,true,"N-terminal ChaFRADIC",92,26010716,"MASCOT Score",27.7500000,,,,,0.047749999910593,
LPGSGLFGSLPIGGIGNLTQLK,ng,N,88,true,"N-glycan occupancy Arabidopsis glycoproteins",87,23994444,"Ladder score",64.3000000,,,,,,
LPGSGLFGSLPIGGIGNLTQLK,ng,N,88,true,"N-linked Glycan Micro-heterogeneity Arabidopsis",134,29237727,,,,,,,,
LPGSGLFGSLPIGGIGNLTQLK,ng,N,88,true,"UDP-GlcNAc transporter glycopeptide analysis",135,30224661,,,,,,,5.6585731638858E-17,0.3000000
NVEAPVAAATSSAAIPK,ph,S,300,true,"Phosphorylation Early Elicitor Signaling",23,17317660,,,,,,,,
ETVVVVPPAKATGSESGAVNK,ub,K,315,true,"upl3 mutant / wildtype",168,35926874,"MaxQuant score",81.0160000,1.0000000,-0.1408255,0.7033600,NO,3.1849999686528E-6,-0.2385800
ATGSESGAVNKDLTFFVK,ph,S,319,true,"Tissue atlas Arabidopsis - ProteomicsDB",114,32188942,"MaxQuant score",98.9570000,0.9940060,,,,5.8534101299301E-7,
ATGSESGAVNK,ph,S,319,true,"Plasmembrane Ph Immune Responses",25,17651370,,,,,,,,
ATGSESGAVNK,ph,S,319,true,"atm and atr DNA damage response",88,25561503,"MASCOT Score",48.0000000,0.9960000,,,,,0.3000000
ATGSESGAVNKDLTFFVK,ph,S,321,true,"Tissue atlas Arabidopsis - ProteomicsDB",114,32188942,"MaxQuant score",139.0200000,0.9983670,,,,1.604430009294E-15,
ATGSESGAVNK,ph,S,321,true,"atm and atr DNA damage response",88,25561503,"MASCOT Score",67.0000000,0.9440000,,,,,-1.3700000
SFGEFDLDGLLKASAEVLGK,ph,S,334,false,"Large-scale phosphorylation discovery",44,23111157,XCorr,3.0840000,,,,,,
SFGEFDLDGLLK,ph,S,334,false,"Tyrosine phosphorylation in Arabidopsis",59,18463617,"MASCOT Score",56.0000000,,,,,,-1.7610227
SFGEFDLDGLLK,ph,S,334,false,"TOR Kinase and ABA Receptor",100,29290610,XCorr,3.8224399,1.0000000,,,,5.1229999371571E-5,
SFGEFDLDGLLKASAEVLGK,ph,S,347,false,"Plasmamembrane phosphorylation",20,15308754,,,,,,,,
SFGEFDLDGLLKASAEVLGK,ph,S,347,false,"Phosphorylation Early Elicitor Signaling",23,17317660,,,,,,,,
SFGEFDLDGLLKASAEVLGK,ph,S,347,false,"Large-scale phosphorylation discovery",44,23111157,XCorr,4.9100000,,,,,,
SFGEFDLDGLLKASAEVLGK,ph,S,347,false,"Tissue atlas Arabidopsis - ProteomicsDB",114,32188942,"MaxQuant score",376.5600000,1.0000000,,,,0,
SFGEFDLDGLLKASAEVLGK,ph,S,347,false,"Touch-induced phosphorylation: 40s touch vs untouc",136,30291188,"MASCOT score",108.4900000,,0.4850796,0.3541040,NO,,3.7167879
ASAEVLGK,ph,S,347,false,"Plasmamembrane phosphorylation",20,15308754,,,,,,,,
ASAEVLGK,ph,S,347,false,"Phosphorylation Early Elicitor Signaling",23,17317660,,,,,,,,
ASAEVLGK,ph,S,347,false,"Sucrose-induced phosphorylation",24,17586839,,,,,,,,
ASAEVLGK,ph,S,347,false,"Plasmembrane Ph Immune Responses",25,17651370,,,,,,,,
ASAEVLGK,ph,S,347,false,"Immuno-dot blot phosphorylation",31,19341826,"MASCOT Score",43.1300000,,,,,,10.7296000
ASAEVLGK,ph,S,347,false,"Phytohormone-responsive phosphoproteins",34,20374526,"MASCOT Score",50.0000000,,,,,,10.7581000
ASAEVLGK,ph,S,347,false,"Tyrosine phosphorylation in Arabidopsis",59,18463617,"MASCOT Score",47.0000000,,,,,,-0.4687165
ASAEVLGK,ph,S,347,false,"srk2dei ABA signaling phopshoproteomics",83,23572148,"MASCOT Score",44.0000000,,,,,,0.0004000
ASAEVLGK,ph,S,347,false,"LAXIC - mannitol vs control",84b,23660473,XCorr,2.0300000,1.0000000,-1.2490629,,NO,0.0014310600236058,
ASAEVLGK,ph,S,347,false,"SnRK2 protein kinase substrates",85,23776212,XCorr,3.0863461,1.0000000,,,,0.059298899024725,
ASAEVLGK,ph,S,347,false,"atm and atr DNA damage response",88,25561503,"MASCOT Score",58.0000000,1.0000000,,,,,1.7300000
ASAEVLGK,ph,S,347,false,"Phospho cell culture sucrose/TOR",109,30833711,,,1.0000000,,,,,
ASAEVLGK,ph,S,347,false,"Col-0 callus - FC Col-0 vs. Col-0 Xray",111a,31410901,,35.6000000,,0.2389819,0.0000000,NO,,-0.0113007
ASAEVLGK,ph,S,347,false,"Col-0 X-ray callus - FC Col-0 vs. Col-0 Xray",111b,31410901,,35.6000000,,0.2389819,0.0000000,NO,,-0.0113007
ASAEVLGK,ph,S,347,false,"atm callus - FC atm vs. atm Xray",111c,31410901,,31.6600000,,-1.6865110,0.0000000,NO,,-0.0674947
ASAEVLGK,ph,S,347,false,"atm-3 X-ray callus - FC atm vs. atm Xray",111d,31410901,,31.6600000,,-1.6865110,0.0000000,NO,,-0.0674947
ASAEVLGK,ph,S,347,false,"Tissue atlas Arabidopsis - ProteomicsDB",114,32188942,"MaxQuant score",114.9700000,1.0000000,,,,8.8670400145929E-5,
ASFEHGLVVAVKR,ac,K,373,true,"Quantitative Acetylproteomics",101,29440448,,,,,,,,
LRDVVVPEKEFR,ub,K,383,false,"upl3 mutant / wildtype",168,35926874,"MaxQuant score",91.5490000,1.0000000,1.3351402,0.2399000,NO,0.0020220701117069,-0.1961100
LIEEVSHSSGSPNPVSD,ph,S,616,true,"Lateral root-induction - NAA vs control",106,23328941,"MASCOT Score",41.0000000,,,,,,
LIEEVSHSSGSPNPVSD,ph,S,618,true,"BSK8 and BSL2 regulating sucrose-ph synthase",66,24924143,"MaxQuant Score",139.8100000,,,,,,0.0885580
LIEEVSHSSGSPNPVSD,ph,S,618,true,"srk2dei ABA signaling phopshoproteomics",83,23572148,"MASCOT Score",33.0000000,,,,,,0.0013000
LIEEVSHSSGSPNPVSD,ph,S,618,true,"TOR Kinase and ABA Receptor",100,29290610,XCorr,4.0782108,0.8574000,,,,1.1440000236007E-7,
LIEEVSHSSGSPNPVSD,ph,S,618,true,"Lateral root-induction - NAA vs control",106,23328941,"MASCOT Score",40.0000000,,,,,,
LIEEVSHSSGSPNPVSD,ph,S,619,true,"Plasmembrane Ph Immune Responses",25,17651370,,,,,,,,
LIEEVSHSSGSPNPVSD,ph,S,619,true,"atm and atr DNA damage response",88,25561503,"MASCOT Score",28.0000000,1.0000000,,,,,1.6500000
LIEEVSHSSGSPNPVSD,ph,S,621,true,"Phosphorylation Early Elicitor Signaling",23,17317660,,,,,,,,
LIEEVSHSSGSPNPVSD,ph,S,621,true,"Phosphorylation nuclei-enriched fractions",28,19245862,,,,,,,,
LIEEVSHSSGSPNPVSD,ph,S,621,true,"Mitochondrial phosphoproteome",32,19688752,"MASCOT Score",50.7100000,,,,,,1.0366700
LIEEVSHSSGSPNPVSD,ph,S,621,true,"Phytohormone-responsive phosphoproteins",34,20374526,"MASCOT Score",80.0000000,,,,,,9.5403500
LIEEVSHSSGSPNPVSD,ph,S,621,true,"ABA-induced protein phosphorylation",35,20733066,,,,,,,,
LIEEVSHSSGSPNPVSD,ph,S,621,true,"STN8 phosphoproteome",38,21768351,"MASCOT Score",53.9600000,,,,,,-1.2619300
LIEEVSHSSGSPNPVSD,ph,S,621,true,"PAMP-triggered phosphorylation",48,24601666,"MASCOT Score",36.9800000,,,,,,
LIEEVSHSSGSPNPVSD,ph,S,621,true,"Tyrosine phosphorylation in Arabidopsis",59,18463617,"MASCOT Score",62.0000000,,,,,,-0.6001805
LIEEVSHSSGSPNPVSD,ph,S,621,true,"Chloroplast kinase substrates",60,19376835,"MASCOT Score",42.7200000,,,,,,-1.0875200
LIEEVSHSSGSPNPVSD,ph,S,621,true,"Conserved plant phosphoproteome - Arabidopsis",61a,20466843,"MASCOT Score",62.0000000,0.7840394,,,,,
LIEEVSHSSGSPNPVSD,ph,S,621,true,"BSK8 and BSL2 regulating sucrose-ph synthase",66,24924143,"MaxQuant Score",171.4700000,,,,,,0.3132400
LIEEVSHSSGSPNPVSD,ph,S,621,true,"srk2dei ABA signaling phopshoproteomics",83,23572148,"MASCOT Score",60.0000000,,,,,,-0.0007000
LIEEVSHSSGSPNPVSD,ph,S,621,true,"LAXIC - ABA stress",84a,23660473,XCorr,4.1100000,0.9930000,,,,0.00024299000506289,
LIEEVSHSSGSPNPVSD,ph,S,621,true,"LAXIC - mannitol vs control",84b,23660473,XCorr,4.2000000,1.0000000,,,,9.5900004453142E-6,
LIEEVSHSSGSPNPVSD,ph,S,621,true,"SnRK2 protein kinase substrates",85,23776212,XCorr,3.8162191,0.9960000,,,,7.5993700221488E-9,
LIEEVSHSSGSPNPVSD,ph,S,621,true,"SIRK1 phosphorylation",86a,23820729,"MaxQuant Score",160.7900000,0.9950000,,,,0.00051869999151677,9.6100000
LIEEVSHSSGSPNPVSD,ph,S,621,true,"SIRK1 exp - sirk1 mutant vs WT",86b,23820729,,,,-0.3895864,,NO,,
LIEEVSHSSGSPNPVSD,ph,S,621,true,"SIRK1 exp - 35S:SIRK1 vs WT",86c,23820729,,,,-0.7465982,,NO,,
LIEEVSHSSGSPNPVSD,ph,S,621,true,"atm and atr DNA damage response",88,25561503,"MASCOT Score",88.0000000,1.0000000,,,,,-0.7100000
LIEEVSHSSGSPNPVSD,ph,S,621,true,"Brassinosteroid-Regulated Phosphorylation Dynamics",94,26187819,"MaxQuant Score",244.3100000,1.0000000,,,,0,-1.7970000
LIEEVSHSSGSPNPVSD,ph,S,621,true,"Protein sumoylation and phosphorylation cross-talk",97,28419593,,,,,,,,
LIEEVSHSSGSPNPVSD,ph,S,621,true,"TOR Kinase and ABA Receptor",100,29290610,XCorr,4.6900067,0.9590000,,,,2.2449999050878E-6,
LIEEVSHSSGSPNPVSD,ph,S,621,true,"Lateral root-induction - NAA vs control",106,23328941,"MASCOT Score",32.0000000,,,,,,
LIEEVSHSSGSPNPVSD,ph,S,621,true,"Phosphorylation tonoplast membrane fraction",107,18686298,"MASCOT Score",54.0000000,,,,,,
LIEEVSHSSGSPNPVSD,ph,S,621,true,"Phospho cell culture sucrose/TOR",109,30833711,,,0.9966100,,,,,
LIEEVSHSSGSPNPVSD,ph,S,621,true,"Col-0 callus - FC Col-0 vs. Col-0 Xray",111a,31410901,,65.3000000,,0.1971667,0.0000000,NO,,1.0896454
LIEEVSHSSGSPNPVSD,ph,S,621,true,"Col-0 X-ray callus - FC Col-0 vs. Col-0 Xray",111b,31410901,,65.3000000,,0.1971667,0.0000000,NO,,1.0896454
LIEEVSHSSGSPNPVSD,ph,S,621,true,"atm callus - FC atm vs. atm Xray",111c,31410901,,65.3000000,,-0.0143227,0.0000000,NO,,1.0896454
LIEEVSHSSGSPNPVSD,ph,S,621,true,"atm-3 X-ray callus - FC atm vs. atm Xray",111d,31410901,,65.3000000,,-0.0143227,0.0000000,NO,,1.0896454
LIEEVSHSSGSPNPVSD,ph,S,621,true,"Tissue atlas Arabidopsis - ProteomicsDB",114,32188942,"MaxQuant score",294.3900000,0.9998570,,,,0,
LIEEVSHSSGSPNPVSD,ph,S,626,true,"Arabidopsis root NAA phosphoproteome",18a,27643528,"MaxQuant Score",42.0290000,0.9990000,,,,0.0010000000474975,-1.5410000
LIEEVSHSSGSPNPVSD,ph,S,626,true,"Plasmamembrane phosphorylation",20,15308754,,,,,,,,
LIEEVSHSSGSPNPVSD,ph,S,626,true,"Phosphorylation Early Elicitor Signaling",23,17317660,,,,,,,,
LIEEVSHSSGSPNPVSD,ph,S,626,true,"Plasmembrane Ph Immune Responses",25,17651370,,,,,,,,
LIEEVSHSSGSPNPVSD,ph,S,626,true,"PAMP-triggered phosphorylation",48,24601666,"MASCOT Score",36.9800000,,,,,,
LIEEVSHSSGSPNPVSD,ph,S,626,true,"Tyrosine phosphorylation in Arabidopsis",59,18463617,"MASCOT Score",40.0000000,,,,,,0.0545618
LIEEVSHSSGSPNPVSD,ph,S,626,true,"Chloroplast kinase substrates",60,19376835,"MASCOT Score",42.4100000,,,,,,-1.2870400
LIEEVSHSSGSPNPVSD,ph,S,626,true,"BSK8 and BSL2 regulating sucrose-ph synthase",66,24924143,"MaxQuant Score",115.5700000,,,,,,0.0628100
LIEEVSHSSGSPNPVSD,ph,S,626,true,"srk2dei ABA signaling phopshoproteomics",83,23572148,"MASCOT Score",49.0000000,,,,,,-0.0012000
LIEEVSHSSGSPNPVSD,ph,S,626,true,"LAXIC - ABA stress",84a,23660473,XCorr,4.1100000,1.0000000,,,,0.00024299000506289,
LIEEVSHSSGSPNPVSD,ph,S,626,true,"LAXIC - mannitol vs control",84b,23660473,XCorr,4.2000000,1.0000000,,,,9.5900004453142E-6,
LIEEVSHSSGSPNPVSD,ph,S,626,true,"SnRK2 protein kinase substrates",85,23776212,XCorr,3.8162191,1.0000000,,,,7.5993700221488E-9,
LIEEVSHSSGSPNPVSD,ph,S,626,true,"atm and atr DNA damage response",88,25561503,"MASCOT Score",102.0000000,1.0000000,,,,,-0.7900000
LIEEVSHSSGSPNPVSD,ph,S,626,true,"Brassinosteroid-Regulated Phosphorylation Dynamics",94,26187819,"MaxQuant Score",244.3100000,1.0000000,,,,0,-0.8760000
LIEEVSHSSGSPNPVSD,ph,S,626,true,"Protein sumoylation and phosphorylation cross-talk",97,28419593,,,,,,,,
LIEEVSHSSGSPNPVSD,ph,S,626,true,"TOR Kinase and ABA Receptor",100,29290610,XCorr,4.6900067,1.0000000,,,,2.2449999050878E-6,
LIEEVSHSSGSPNPVSD,ph,S,626,true,"Lateral root-induction - NAA vs control",106,23328941,"MASCOT Score",61.0000000,,,,,,
LIEEVSHSSGSPNPVSD,ph,S,626,true,"Phosphorylation tonoplast membrane fraction",107,18686298,"MASCOT Score",68.0000000,,,,,,
LIEEVSHSSGSPNPVSD,ph,S,626,true,"Phospho cell culture sucrose/TOR",109,30833711,,,1.0000000,,,,,
LIEEVSHSSGSPNPVSD,ph,S,626,true,"Col-0 callus - FC Col-0 vs. Col-0 Xray",111a,31410901,,73.4400000,,-0.6318415,0.0000000,NO,,1.2632958
LIEEVSHSSGSPNPVSD,ph,S,626,true,"Col-0 X-ray callus - FC Col-0 vs. Col-0 Xray",111b,31410901,,73.4400000,,-0.6318415,0.0000000,NO,,1.2632958
LIEEVSHSSGSPNPVSD,ph,S,626,true,"atm callus - FC atm vs. atm Xray",111c,31410901,,73.4400000,,0.3998674,0.0000000,NO,,1.2632958
LIEEVSHSSGSPNPVSD,ph,S,626,true,"atm-3 X-ray callus - FC atm vs. atm Xray",111d,31410901,,73.4400000,,0.3998674,0.0000000,NO,,1.2632958
LIEEVSHSSGSPNPVSD,ph,S,626,true,"Tissue atlas Arabidopsis - ProteomicsDB",114,32188942,"MaxQuant score",335.1400000,1.0000000,,,,0,
LIEEVSHSSGSPNPVSD,ph,S,626,true,"Touch-induced phosphorylation: 40s touch vs untouc",136,30291188,"MASCOT score",77.5100000,,0.0112895,0.9366571,NO,,2.7537909
