Peptide,PTM,ModifiedAA,ModifiedPosition,PeptideUniqueToGene,ExperimentDesc,ExpID,PubmedID,ScoreType,IdentScore,LocProb,Log2FChange,PQ-val,QuantSig,PEP,MassErrorPPM
ADNDSLDQFLAAAIDAAKKAGQIIR,nt,A,2,true,"N-terminal ChaFRADIC",92,26010716,"MASCOT Score",22.2000000,,,,,5.4129999625729E-5,
ADNDSLDQFL,nt,A,2,true,"N-term acetylation drought responses",5,26184543,,,,,,,,
ADNDSLDQFLAAAIDAAKKAGQIIR,nta,A,2,true,"N-terminal ChaFRADIC",92,26010716,"MASCOT Score",22.2000000,,,,,5.4129999625729E-5,
ADNDSLDQFLAAAIDAAKKAGQIIR,nta,A,2,true,"Arabidopsis translation initiation landscape - NTA",167a,35069635,,,,,,,,
ADNDSLDQFLAAAIDAAK,nta,A,2,true,"Characterization plant N-terminal acetylation",6,22223895,"MASCOT Score",88.2300000,,,,,,
ADNDSLDQFL,nta,A,2,true,"N-term acetylation drought responses",5,26184543,,,,,,,,
GQVDLVTETDKGCEELVFNHLK,sno,C,51,true,"Site-specific nitrosomeproteomic id - gsnor1-3",90b,25699590,XCorr,3.3500000,,,,,0.0015820000553504,-6.1900000
GCEELVFNHLK,sno,C,51,true,"Site-specific nitrosomeproteomic id - gsnor1-3",90a,25699590,XCorr,3.6685526,,,,,1.3379999472818E-6,-5.9683617
GCEELVFNHLK,sno,C,51,true,"Site-specific nitrosomeproteomic id - gsnor1-3",90b,25699590,XCorr,4.1400000,,,,,0.0036049999762326,-7.0200000
GQVDLVTETDKGCEELVFNHLK,so,C,51,true,"Arabidopsis S-sulfenylation chemoproteomics",108,31578252,"pFind PSM Score",0.0758365,,,,,,-1.3673201
GAFLNGKR,ac,K,145,true,"Quantitative Acetylproteomics",101,29440448,,,,,,,,
ALLVTEAGTKR,nt,A,158,true,"Arabidopsis translation initiation landscape - NT",167b,35069635,,,,,,,,
