Peptide,PTM,ModifiedAA,ModifiedPosition,PeptideUniqueToGene,ExperimentDesc,ExpID,PubmedID,ScoreType,IdentScore,LocProb,Log2FChange,PQ-val,QuantSig,PEP,MassErrorPPM
AFSGTAMTDTKDAGMDAVQR,nt,A,46,true,"N-terminal ChaFRADIC",92,26010716,"MASCOT Score",30.9300000,,,,,0.00072479998925701,
AFSGTAMTDTKDAGMDAVQRRLMFE,nta,A,46,true,"Arabidopsis translation initiation landscape - NTA",167a,35069635,,,,,,,,
AFSGTAMTDTKDAGMDAVQR,nta,A,46,true,"N-terminal ChaFRADIC",92,26010716,"MASCOT Score",30.9300000,,,,,0.00072479998925701,
AFSGTAMTDTK,nta,A,46,true,"Characterization plant N-terminal acetylation",6,22223895,"MASCOT Score",51.9200000,,,,,,
SGTAMTDTKDAGMDAVQRRLMFE,nt,S,48,true,"Arabidopsis translation initiation landscape - NT",167b,35069635,,,,,,,,
SGTAMTDTKDAGMDAVQR,nt,S,48,true,"Arg/N-end rule pathway Roots",80,25728785,"MASCOT Score",33.8100000,,,,,0.00077340001007542,
SGTAMTDTKDAGMDAVQR,nt,S,48,true,"HUNTER N-terminome: legumain, GluC and trypsin",119,31951383,"MaxQuant score",67.6460000,,,,,,
SGTAMTDTKDAGMDAVQR,nt,S,48,true,"Mitochondrial intermediate peptidases - icp55 / WT",131a,25732537,,72.8500000,,-1.6641469,,,,
SGTAMTDTKDAGMDAVQR,nta,S,48,true,"FtsH12 N-terminome: WT / FtsH12 knockdown miRNA",118,33216923,"MaxQuant score",101.4300000,,,,,1.4900000272944E-30,
GTAMTDTKDAGMDAVQR,nt,G,49,true,"Arabidopsis translation initiation landscape - NT",167b,35069635,,,,,,,,
TDTKDAGMDAVQR,nt,T,53,true,"N-terminal ChaFRADIC",92,26010716,"MASCOT Score",25.0300000,,,,,0.00043909999658354,
TDTKDAGMDAVQR,nt,T,53,true,"Arg/N-end rule seed, prt6 vs. Wt",99,29168982,"MASCOT Score",59.8600000,,,,,0.015769999474287,-0.4037156
TDTKDAGMDAVQR,nt,T,53,true,"FtsH12 N-terminome: WT / FtsH12 knockdown miRNA",118,33216923,"MaxQuant score",77.9230000,,,,,0.01277600042522,
TDTKDAGMDAVQRRLMFE,nta,T,53,true,"Arabidopsis translation initiation landscape - NTA",167a,35069635,,,,,,,,
TDTKDAGMDAVQR,nta,T,53,true,"Arg/N-end rule pathway Roots",80,25728785,"MASCOT Score",58.6800000,,,,,4.96499997098E-5,
TDTKDAGMDAVQR,nta,T,53,true,"N-terminal ChaFRADIC",92,26010716,"MASCOT Score",25.0300000,,,,,0.00043909999658354,
TDTKDAGMDAVQR,nta,T,53,true,"Arg/N-end rule seed, prt6 vs. Wt",99,29168982,"MASCOT Score",59.8600000,,-0.1576266,0.1779564,NO,0.015769999474287,-0.4037156
TDTKDAGMDAVQR,nta,T,53,true,"FtsH12 N-terminome: WT / FtsH12 knockdown miRNA",118,33216923,"MaxQuant score",179.6800000,,,,,8.7500000648278E-18,
ILVDETDR,nt,I,74,true,"Arg/N-end rule seed, prt6 vs. Wt",99,29168982,"MASCOT Score",35.4100000,,-0.7255462,0.0000008,NO,0.097939997911453,-1.2212626
YNCHLMENIEAK,sno,C,91,true,"Site-specific nitrosomeproteomic id - gsnor1-3",90a,25699590,XCorr,2.7766528,,,,,0.032469999045134,-4.6730747
YNCHLMENIEAK,sno,C,91,true,"Site-specific nitrosomeproteomic id - gsnor1-3",90b,25699590,XCorr,3.0000000,,,,,0.036779999732971,-5.9500000
YNCHLMENIEAK,so,C,91,true,"Arabidopsis S-sulfenylation chemoproteomics",108,31578252,"pFind PSM Score",0.0000013,,1.9883500,,,,-0.7271122
