Peptide,PTM,ModifiedAA,ModifiedPosition,PeptideUniqueToGene,ExperimentDesc,ExpID,PubmedID,ScoreType,IdentScore,LocProb,Log2FChange,PQ-val,QuantSig,PEP,MassErrorPPM
VSVGQVTE,nt,V,65,true,"N-terminal ChaFRADIC",92,26010716,"MASCOT Score",34.3600000,,,,,0.11720000207424,
VSVGQVTE,nt,V,65,true,"Arg/N-end rule seed, prt6 vs. Wt",99,29168982,"MASCOT Score",30.4900000,,-0.0197740,0.8689147,NO,0.01642999984324,-0.2013536
LVVLDMYTQWCGPCK,sno,C,102,true,"hot5-4 / wildtype, FAT-switch S-nitrosoproteome",169,37277371,,,,0.1135981,0.6586924,NO,,
VIAPKYK,ac,K,108,false,"Quantitative Acetylproteomics",101,29440448,,,,,,,,
YDDVVFLKLDCNPDNRPLAK,ac,K,123,true,"Histone deacetylases substrates - hda14 vs WT",98e,29061669,"MaxQuant Score",77.9000000,1.0000000,0.1700000,0.9204496,NO,2.2000000043931E-8,
LDCNPDNRPLAK,sno,C,126,true,"Site-specific nitrosomeproteomic id - gsnor1-3",90a,25699590,XCorr,2.2280672,,,,,0.0093719996511936,-5.2565982
LDCNPDNRPLAK,sno,C,126,true,"Site-specific nitrosomeproteomic id - gsnor1-3",90b,25699590,XCorr,2.5422299,,,,,0.11089999973774,-7.4860688
LDCNPDNRPLAK,sno,C,126,true,"hot5-4 / wildtype, FAT-switch S-nitrosoproteome",169,37277371,,,,-0.3204724,0.1086751,NO,,
PLAKELGIR,ub,K,135,false,"Arabidopsis ubiquitination COFRADIC",40,26744219,"MaxQuant Score",63.8160000,1.0000000,,,,0.017000000923872,0.1390000
VVPTFKILK,ac,K,146,false,"Quantitative Acetylproteomics",101,29440448,,,,,,,,
