Peptide,PTM,ModifiedAA,ModifiedPosition,PeptideUniqueToGene,ExperimentDesc,ExpID,PubmedID,ScoreType,IdentScore,LocProb,Log2FChange,PQ-val,QuantSig,PEP,MassErrorPPM
AVQPTRIGLAGLAVMGQNLALNIAE,nta,A,2,true,"Arabidopsis translation initiation landscape - NTA",167a,35069635,,,,,,,,
AVQPTRIGLAGLAVMGQN,nta,A,2,true,"HUNTER N-terminome: legumain, GluC and trypsin",119,31951383,"MaxQuant score",239.1900000,,,,,,
TTSKVDETVER,ph,S,39,true,"Chloroplast kinase substrates",60,19376835,"MASCOT Score",40.6400000,,,,,,-0.8289040
TTSKVDETVER,ph,S,39,true,"atm and atr DNA damage response",88,25561503,"MASCOT Score",25.0000000,0.9940000,,,,,-1.2300000
TTSKVDETVER,ph,S,39,true,"Tissue atlas Arabidopsis - ProteomicsDB",114,32188942,"MaxQuant score",71.3440000,0.9846220,,,,0.00065982999512926,
TTSKVDETVER,ac,K,40,true,"Quantitative Acetylproteomics",101,29440448,,,,,,,,
AGSPVDQTIKTLSAYLEK,ac,K,90,true,"Histone deacetylases substrates - TSA vs control",98b,29061669,"MaxQuant Score",49.7000000,1.0000000,0.0710000,0.9977001,NO,1.1000000085915E-5,
GDCIVDGGNEWYENTERR,ox,C,101,true,"SPEAR - 10 mM H2O2 / mock",138a,34619326,,,,3.4871796,0.0003647,YES,,
GDCIVDGGNEWYENTER,sno,C,101,true,"Site-specific nitrosomeproteomic id - gsnor1-3",90a,25699590,XCorr,3.6148913,,,,,3.5549998500528E-8,-7.1794440
GDCIVDGGNEWYENTER,sno,C,101,true,"Site-specific nitrosomeproteomic id - gsnor1-3",90b,25699590,XCorr,3.3600000,,,,,7.6499998158397E-7,-7.7900000
GDCIVDGGNEWYENTER,so,C,101,true,"S-sulfenylation site detection using YAP1C",110,32714340,,,,,,,,
IVDGGNEWYENTER,nt,I,102,true,"Arg/N-end rule seed, prt6 vs. Wt",99,29168982,"MASCOT Score",50.8800000,,-0.2945022,0.4169929,NO,0.0083510000258684,-2.2122767
LGMGVSGGEEGAR,nt,L,128,false,"Arg/N-end rule seed, prt6 vs. Wt",99,29168982,"MASCOT Score",42.9000000,,,,,0.043230000883341,-1.4204563
GMGVSGGEE,nt,G,129,false,"Arg/N-end rule seed, prt6 vs. Wt",99,29168982,"MASCOT Score",45.6400000,,-0.1992348,0.6454181,NO,0.011900000274181,0.6205477
MGVSGGEE,nt,M,130,false,"Arg/N-end rule seed, prt6 vs. Wt",99,29168982,"MASCOT Score",57.7400000,,0.0098068,0.9822603,NO,0.020630000159144,-0.2789427
DSGPCVTYIGK,acy,C,174,true,"Arabidopsis S-acylation atlas - Meristem",163a,35681017,,,,,,,,
DSGPCVTYIGK,acy,C,174,true,"Arabidopsis S-acylation atlas - Hypocotyl",163b,35681017,,,,,,,,
DSGPCVTYIGK,ox,C,174,true,"OxiTRAQ Arabidopsis - 5 mM H2O2 versus control",47,24376095,,,,-0.1083685,0.1168097,NO,,
DSGPCVTYIGK,sno,C,174,true,"hot5-4 / wildtype, FAT-switch S-nitrosoproteome",169,37277371,,,,-0.1856679,0.1360198,NO,,
DSGPCVTYIGK,so,C,174,true,"S-sulfenylation site detection using YAP1C",110,32714340,,,,,,,,
SNEELHSVF,nt,S,216,true,"N-terminal ChaFRADIC",92,26010716,"MASCOT Score",39.0200000,,,,,0.00093769998056814,
VQAAKVFK,ac,K,307,true,"Quantitative Acetylproteomics",101,29440448,,,,,,,,
AGGFGDILTDQKVDKK,ph,T,319,true,"Tissue atlas Arabidopsis - ProteomicsDB",114,32188942,"MaxQuant score",100.2800000,1.0000000,,,,3.6862400065729E-6,
ICSYAQGMNLIR,cn,C,342,true,"Cellular regulation by S-cyanylation",115,30377236,,,,,,,,
ICSYAQGMNLIR,so,C,342,true,"S-sulfenylation site detection using YAP1C",110,32714340,,,,,,,,
GGCIIR,sno,C,375,false,"hot5-4 / wildtype, FAT-switch S-nitrosoproteome",169,37277371,,,,,,,,
