Peptide,PTM,ModifiedAA,ModifiedPosition,PeptideUniqueToGene,ExperimentDesc,ExpID,PubmedID,ScoreType,IdentScore,LocProb,Log2FChange,PQ-val,QuantSig,PEP,MassErrorPPM
GGVGSGQSTGLR,ph,S,14,true,"Tissue atlas Arabidopsis - ProteomicsDB",114,32188942,"MaxQuant score",102.3300000,0.9985910,,,,0.00011433900363045,
FLNSSYAPVLR,ng,N,320,true,"Conserved N-glycosylation",74,22633491,"MaxQuant Score",133.8300000,1.0000000,,,,1.3850000139815E-11,-0.2960000
FLNSSYAPVLR,ng,N,320,true,"N-linked Glycan Micro-heterogeneity Arabidopsis",134,29237727,,,,,,,,
FLNSSYAPVLR,ng,N,320,true,"UDP-GlcNAc transporter glycopeptide analysis",135,30224661,,,,,,,0.00032671168446541,-0.1000000
FYFENQAENATK,ng,N,346,true,"Conserved N-glycosylation",74,22633491,"MaxQuant Score",143.8300000,1.0000000,,,,1.802000084252E-14,0.9010000
FYFENQAENATK,ng,N,346,true,"N-linked Glycan Micro-heterogeneity Arabidopsis",134,29237727,,,,,,,,
FYFENQAENATK,ng,N,346,true,"UDP-GlcNAc transporter glycopeptide analysis",135,30224661,,,,,,,2.0855949346005E-12,1.2000000
YGQYLNFSHPLIK,ng,N,426,true,"Conserved N-glycosylation",74,22633491,"MaxQuant Score",86.6590000,1.0000000,,,,0.00063040002714843,0.3420000
YGQYLNFSHPLIK,ng,N,426,true,"N-linked Glycan Micro-heterogeneity Arabidopsis",134,29237727,,,,,,,,
YGQYLNFSHPLIK,ng,N,426,true,"UDP-GlcNAc transporter glycopeptide analysis",135,30224661,,,,,,,1.786834975771E-14,0.0000000
LGTLPPGLITFYSKTK,ac,K,492,true,"Histone deacetylases- hda14 vs WT (low light)",98c,29061669,"MaxQuant Score",66.3900000,1.0000000,1.2910000,0.9246982,NO,0.003000000026077,
LGTLPPGLITFYSKTK,ac,K,492,true,"Histone deacetylases substrates - hda14 vs WT",98e,29061669,"MaxQuant Score",58.1000000,1.0000000,-0.0120000,0.9954054,NO,0.00022000000171829,
