Peptide,PTM,ModifiedAA,ModifiedPosition,PeptideUniqueToGene,ExperimentDesc,ExpID,PubmedID,ScoreType,IdentScore,LocProb,Log2FChange,PQ-val,QuantSig,PEP,MassErrorPPM
ADDLANLCR,nt,A,2,true,"Arg/N-end rule seed, prt6 vs. Wt",99,29168982,"MASCOT Score",69.4900000,,,,,0.011959999799728,-0.1809946
ADDLANLCR,nta,A,2,true,"Characterization plant N-terminal acetylation",6,22223895,"MASCOT Score",67.3400000,,,,,,
ADDLANLCR,nta,A,2,true,"Arg/N-end rule seed, prt6 vs. Wt",99,29168982,"MASCOT Score",69.4900000,,,,,0.011959999799728,-0.1809946
ADDLANLCR,nta,A,2,true,"HUNTER N-terminome: legumain, GluC and trypsin",119,31951383,"MaxQuant score",131.0600000,,,,,,
ADDLANLCR,nta,A,2,true,"Arabidopsis translation initiation landscape - NTA",167a,35069635,,,,,,,,
ADDLANLCR,so,C,9,true,"S-sulfenylation site detection using YAP1C",110,32714340,,,,,,,,
NMEILLEIASFDGSE,nt,N,145,true,"HUNTER N-terminome: legumain, GluC and trypsin",119,31951383,"MaxQuant score",72.4340000,,,,,,
SPFQQDCGDLNPFTR,sno,C,239,true,"hot5-4 / wildtype, FAT-switch S-nitrosoproteome",169,37277371,,,,,,,,
TYSSLR,ph,S,506,false,"STN8 phosphoproteome",38,21768351,"MASCOT Score",43.8000000,,,,,,-0.8786540
TYSSLR,ph,S,506,false,"Chloroplast kinase substrates",60,19376835,"MASCOT Score",36.9400000,,,,,,0.0379235
TYSSLR,ph,S,506,false,"srk2dei ABA signaling phopshoproteomics",83,23572148,"MASCOT Score",29.0000000,,,,,,-0.0001000
TYSSLR,ph,S,506,false,"TOR Kinase and ABA Receptor",100,29290610,XCorr,2.0316341,0.9206000,,,,0.0304000005126,
TYSSLR,ph,S,506,false,"Lateral root-induction - NAA vs control",106,23328941,"MASCOT Score",26.0000000,,,,,,
SNSFAEVESQISHDDEALFGNLFSEGSR,ph,S,510,true,"SnRK2 protein kinase substrates",85,23776212,XCorr,3.2985222,0.9890000,,,,2.3067500687368E-10,
SNSFAEVESQISHDDEALFGNLFSEGSR,ph,S,512,true,"Arabidopsis root NAA phosphoproteome",18a,27643528,"MaxQuant Score",181.8500000,0.9770000,,,,0,-0.3040000
SNSFAEVESQISHDDEALFGNLFSEGSR,ph,S,512,true,"SnRK2 protein kinase substrates",85,23776212,XCorr,3.2985222,0.9890000,,,,2.3067500687368E-10,
SNSFAEVESQISHDDEALFGNLFSEGSR,ph,S,512,true,"TOR Kinase and ABA Receptor",100,29290610,XCorr,4.5361638,0.8556000,,,,3.1839999792282E-7,
SNSFAEVESQISHDDEALFGNLFSEGSR,ph,S,512,true,"Tissue atlas Arabidopsis - ProteomicsDB",114,32188942,"MaxQuant score",189.6800000,0.9905080,,,,0,
SNSFAEVESQISHDDEALFGNLFSEGSR,ph,S,521,true,"SnRK2 protein kinase substrates",85,23776212,XCorr,3.6232092,0.8380000,,,,4.9680198571878E-5,
GICAEALSLK,sno,C,704,true,"hot5-4 / wildtype, FAT-switch S-nitrosoproteome",169,37277371,,,,-0.1378680,0.4157304,NO,,
FSNLIASCLHK,so,C,748,true,"Arabidopsis S-sulfenylation chemoproteomics",108,31578252,"pFind PSM Score",0.0002012,,1.0225800,,,,-0.9825688
TLNLDYGDLSASLCR,sno,C,878,true,"hot5-4 / wildtype, FAT-switch S-nitrosoproteome",169,37277371,,,,,,,,
NSCSEIDPFWK,sno,C,1009,true,"hot5-4 / wildtype, FAT-switch S-nitrosoproteome",169,37277371,,,,,,,,
SPSHGESLCGK,sno,C,1491,true,"hot5-4 / wildtype, FAT-switch S-nitrosoproteome",169,37277371,,,,-0.4948118,0.1191117,NO,,
GTNNFQSFLPLSEDADQLGESDSDVEEDGFGEENHVVLYIPK,ph,S,1677,true,"Brassinosteroid-Regulated Phosphorylation Dynamics",94,26187819,"MaxQuant Score",87.8820000,0.9990000,,,,4.2070000261241E-10,-0.5150000
GTNNFQSFLPLSEDADQLGESDSDVEEDGFGEENHVVLYIPK,ph,S,1679,true,"Brassinosteroid-Regulated Phosphorylation Dynamics",94,26187819,"MaxQuant Score",87.8820000,0.9990000,,,,4.2070000261241E-10,-0.5150000
GDGVCAQNLR,sno,C,2082,true,"hot5-4 / wildtype, FAT-switch S-nitrosoproteome",169,37277371,,,,0.3371881,0.0069534,NO,,
SGVDTDSNFTAEK,ph,T,2138,true,"Tissue atlas Arabidopsis - ProteomicsDB",114,32188942,"MaxQuant score",169.0500000,0.9996400,,,,1.5107899875794E-14,
VLGHGLLLPGSSK,ph,S,2331,true,"Tissue atlas Arabidopsis - ProteomicsDB",114,32188942,"MaxQuant score",163.6200000,0.9794090,,,,1.6222599652504E-10,
QEVVLSELKCK,so,C,2375,true,"Arabidopsis S-sulfenylation chemoproteomics",108,31578252,"pFind PSM Score",0.0946453,,,,,,-0.3853285
ETLLQTTACR,sno,C,2396,true,"hot5-4 / wildtype, FAT-switch S-nitrosoproteome",169,37277371,,,,,,,,
QTMLTTDDLVDNVTTPSVPIR,ph,T,2589,true,"Tissue atlas Arabidopsis - ProteomicsDB",114,32188942,"MaxQuant score",322.7900000,0.9927240,,,,0,
QAINELVDRCLNPDVIR,so,C,3287,true,"Arabidopsis S-sulfenylation chemoproteomics",108,31578252,"pFind PSM Score",0.3663530,,,,,,0.6638265
CLNPDVIR,so,C,3287,true,"S-sulfenylation site detection using YAP1C",110,32714340,,,,,,,,
SCHLSFNQTELK,so,C,3421,true,"Arabidopsis S-sulfenylation chemoproteomics",108,31578252,"pFind PSM Score",0.0807730,,,,,,-0.8483109
SMDIALATR,nt,S,3749,true,"Arabidopsis translation initiation landscape - NT",167b,35069635,,,,,,,,
IISVACTPPKPDTAEK,ox,C,3814,true,"SPEAR - 10 mM H2O2 / mock",138a,34619326,,,,4.9723094,0.0117294,YES,,
IISVACTPPKPDTAEK,ox,C,3814,true,"SPEAR - 50 mM H2O2 / mock",138b,34619326,,,,3.9071198,0.0270293,YES,,
SAPAVQEKDENAAGVIK,ph,S,3831,true,"Tissue atlas Arabidopsis - ProteomicsDB",114,32188942,"MaxQuant score",114.2800000,1.0000000,,,,9.3330303485573E-9,
YSSESEENNLNVSQK,ph,S,3849,true,"Large-scale phosphorylation discovery",44,23111157,XCorr,4.5000000,,,,,,
YSSESEENNLNVSQK,ph,S,3850,true,"Tyrosine phosphorylation in Arabidopsis",59,18463617,"MASCOT Score",39.0000000,,,,,,-0.6088349
YSSESEENNLNVSQK,ph,S,3850,true,"SnRK2 protein kinase substrates",85,23776212,XCorr,3.0628605,0.9000000,,,,7.327009832192E-11,
YSSESEENNLNVSQK,ph,S,3850,true,"atm and atr DNA damage response",88,25561503,"MASCOT Score",39.0000000,0.9940000,,,,,-1.5800000
YSSESEENNLNVSQK,ph,S,3850,true,"TOR Kinase and ABA Receptor",100,29290610,XCorr,4.8027248,0.9156000,,,,1.1670000077402E-8,
YSSESEENNLNVSQK,ph,S,3850,true,"Lateral root-induction - NAA vs control",106,23328941,"MASCOT Score",45.0000000,,-0.3958924,0.0552357,NO,,
YSSESEENNLNVSQK,ph,S,3850,true,"Phospho cell culture sucrose/TOR",109,30833711,,,0.9904250,,,,,
YSSESEENNLNVSQK,ph,S,3850,true,"Tissue atlas Arabidopsis - ProteomicsDB",114,32188942,"MaxQuant score",242.3500000,0.9999160,,,,0,
ACVSGLQTHAEENK,sno,C,4123,true,"hot5-4 / wildtype, FAT-switch S-nitrosoproteome",169,37277371,,,,-0.1650287,0.0264592,NO,,
ACVSGLQTHAEENK,so,C,4123,true,"Arabidopsis S-sulfenylation chemoproteomics",108,31578252,"pFind PSM Score",0.0281351,,1.2195100,,,,-0.1931935
SNQSSTSLTNSALLASNAAPSR,ph,S,4243,true,"Tissue atlas Arabidopsis - ProteomicsDB",114,32188942,"MaxQuant score",124.2100000,0.7969990,,,,4.7512499098061E-21,
SNQSSTSLTNSALLASNAAPSR,ph,S,4250,true,"Tissue atlas Arabidopsis - ProteomicsDB",114,32188942,"MaxQuant score",308.2200000,0.9994280,,,,0,
QELSSDGGER,ph,S,4673,true,"Tissue atlas Arabidopsis - ProteomicsDB",114,32188942,"MaxQuant score",111.5200000,0.8108390,,,,0.0002093819930451,
