Peptide,PTM,ModifiedAA,ModifiedPosition,PeptideUniqueToGene,ExperimentDesc,ExpID,PubmedID,ScoreType,IdentScore,LocProb,Log2FChange,PQ-val,QuantSig,PEP,MassErrorPPM
GSRQGPPKHQNKF,nta,G,2,true,"Arabidopsis translation initiation landscape - NTA",167a,35069635,,,,,,,,
DIYEVEAEQKLLDETIKNAR,ub,K,117,true,"Arabidopsis ubiquitination COFRADIC",40,26744219,"MaxQuant Score",102.9800000,0.8720000,,,,7.4889593828911E-41,-0.0560000
DNKPNKSDEEASR,ph,S,147,true,"Tissue atlas Arabidopsis - ProteomicsDB",114,32188942,"MaxQuant score",102.1600000,0.9997950,,,,6.7051696532872E-5,
VGDVFPSTSLEEYANK,ph,S,165,true,"Tissue atlas Arabidopsis - ProteomicsDB",114,32188942,"MaxQuant score",79.3370000,0.7936160,,,,0.0003346299927216,
VGDVFPSTSLEEYANK,ph,S,167,true,"TOR Kinase and ABA Receptor",100,29290610,XCorr,4.3006401,0.9127000,,,,1.1739999763449E-6,
VGDVFPSTSLEEYANK,ph,S,167,true,"Tissue atlas Arabidopsis - ProteomicsDB",114,32188942,"MaxQuant score",146.2700000,0.9592490,,,,6.4077798622719E-10,
SDSSKVGDVFPSTSLEEYANKSGR,ub,K,174,true,"Arabidopsis ubiquitination COFRADIC",40,26744219,"MaxQuant Score",66.9250000,0.7580000,,,,2.4560000109174E-21,0.8610000
VGDVFPSTSLEEYANKSGR,ph,S,175,true,"Tissue atlas Arabidopsis - ProteomicsDB",114,32188942,"MaxQuant score",154.7700000,0.9999320,,,,1.609529944318E-22,
VSGIIGHGSVPDHAHDDASGPESDEDDNVGDDEHDLREDSDENEQSQLQK,ph,S,200,true,"PAMP-triggered phosphorylation",48,24601666,"MASCOT Score",30.5100000,,,,,,
VSGIIGHGSVPDHAHDDASGPESDEDDNVGDDEHDLR,ph,S,200,true,"Tissue atlas Arabidopsis - ProteomicsDB",114,32188942,"MaxQuant score",301.1500000,1.0000000,,,,0,
VSGIIGHGSVPDHAHDDASGPESDEDDNVGDDEHDLREDSDENEQSQLQK,ph,S,217,true,"PAMP-triggered phosphorylation",48,24601666,"MASCOT Score",30.5100000,,,,,,
EDSDENEQSQLQK,ph,S,217,true,"STN8 phosphoproteome",38,21768351,"MASCOT Score",59.7300000,,,,,,-1.7921700
EDSDENEQSQLQK,ph,S,217,true,"Chloroplast kinase substrates",60,19376835,"MASCOT Score",57.6600000,,,,,,-0.5901890
EDSDENEQSQLQK,ph,S,217,true,"LAXIC - mannitol vs control",84b,23660473,XCorr,2.0800000,1.0000000,,,,5.6299999414477E-5,
EDSDENEQSQLQK,ph,S,217,true,"Tissue atlas Arabidopsis - ProteomicsDB",114,32188942,"MaxQuant score",377.1500000,1.0000000,,,,0,
