Peptide,PTM,ModifiedAA,ModifiedPosition,PeptideUniqueToGene,ExperimentDesc,ExpID,PubmedID,ScoreType,IdentScore,LocProb,Log2FChange,PQ-val,QuantSig,PEP,MassErrorPPM
GKARGVNNGVNESSLGY,nt,G,2,true,"Arabidopsis translation initiation landscape - NT",167b,35069635,,,,,,,,
TSAGVRGSPNNYFR,ph,T,66,true,"srk2dei ABA signaling phopshoproteomics",83,23572148,"MASCOT Score",22.0000000,,,,,,0.0012000
TSAGVRGSPNNYFR,ph,S,73,true,"STN8 phosphoproteome",38,21768351,"MASCOT Score",45.8400000,,,,,,0.2252160
TSAGVRGSPNNYFR,ph,S,73,true,"Chloroplast kinase substrates",60,19376835,"MASCOT Score",54.5500000,,,,,,0.7850110
TSAGVRGSPNNYFR,ph,S,73,true,"srk2dei ABA signaling phopshoproteomics",83,23572148,"MASCOT Score",43.0000000,,,,,,-0.0002000
TSAGVRGSPNNYFR,ph,S,73,true,"SnRK2 protein kinase substrates",85,23776212,XCorr,2.7340360,0.9990000,,,,0.0040941601619124,
TSAGVRGSPNNYFR,ph,S,73,true,"atm and atr DNA damage response",88,25561503,"MASCOT Score",33.0000000,1.0000000,,,,,1.1600000
TSAGVRGSPNNYFR,ph,S,73,true,"TOR Kinase and ABA Receptor",100,29290610,XCorr,2.5616984,0.9878000,,,,0.0039929999038577,
GSPNNYFR,ph,S,73,true,"STN8 phosphoproteome",38,21768351,"MASCOT Score",49.0000000,,,,,,0.5366130
GSPNNYFR,ph,S,73,true,"Tyrosine phosphorylation in Arabidopsis",59,18463617,"MASCOT Score",35.0000000,,,,,,-0.4838392
GSPNNYFR,ph,S,73,true,"Chloroplast kinase substrates",60,19376835,"MASCOT Score",38.3100000,,,,,,1.1740400
GSPNNYFR,ph,S,73,true,"srk2dei ABA signaling phopshoproteomics",83,23572148,"MASCOT Score",41.0000000,,,,,,-0.0002000
GSPNNYFR,ph,S,73,true,"atm and atr DNA damage response",88,25561503,"MASCOT Score",40.0000000,1.0000000,,,,,-0.6900000
GSPNNYFR,ph,S,73,true,"Protein sumoylation and phosphorylation cross-talk",97,28419593,,,,,,,,
GSPNNYFR,ph,S,73,true,"Phospho cell culture sucrose/TOR",109,30833711,,,0.9999980,,,,,
GSPNNYFR,ph,S,73,true,"Col-0 callus - FC Col-0 vs. Col-0 Xray",111a,31410901,,41.0300000,,0.5812693,0.0000000,NO,,0.2600141
GSPNNYFR,ph,S,73,true,"Col-0 X-ray callus - FC Col-0 vs. Col-0 Xray",111b,31410901,,41.0300000,,0.5812693,0.0000000,NO,,0.2600141
GSPNNYFR,ph,S,73,true,"atm callus - FC atm vs. atm Xray",111c,31410901,,41.0300000,,0.1132291,0.0000000,NO,,0.2600141
GSPNNYFR,ph,S,73,true,"atm-3 X-ray callus - FC atm vs. atm Xray",111d,31410901,,41.0300000,,0.1132291,0.0000000,NO,,0.2600141
GSPNNYFR,ph,S,73,true,"Tissue atlas Arabidopsis - ProteomicsDB",114,32188942,"MaxQuant score",155.5800000,1.0000000,,,,1.7069099556011E-7,
TSAGVRGSPNNYFR,ph,Y,77,true,"srk2dei ABA signaling phopshoproteomics",83,23572148,"MASCOT Score",27.0000000,,,,,,-0.0007000
SEGQNCGNFLTDRPSTK,acy,C,85,true,"Arabidopsis S-acylation atlas - Leaf",163c,35681017,,,,,,,,
SEGQNCGNFLTDRPSTK,sno,C,85,true,"hot5-4 / wildtype, FAT-switch S-nitrosoproteome",169,37277371,,,,0.2974167,0.1757202,NO,,
SEGQNCGNFLTDRPSTK,so,C,85,true,"S-sulfenylation site detection using YAP1C",110,32714340,,,,,,,,
SEGQNCGNFLTDRPSTK,ph,S,94,true,"Tissue atlas Arabidopsis - ProteomicsDB",114,32188942,"MaxQuant score",138.0200000,0.9619410,,,,1.4011500428868E-15,
VHAAPGGGSSLDYLFGGPSPAGSGNK,ph,S,115,true,"TOR Kinase and ABA Receptor",100,29290610,XCorr,5.2545347,0.9999000,,,,1.2030000329233E-9,
VHAAPGGGSSLDYLFGGPSPAGSGNK,ph,S,115,true,"Tissue atlas Arabidopsis - ProteomicsDB",114,32188942,"MaxQuant score",169.9600000,0.9994790,,,,0,
