Peptide,PTM,ModifiedAA,ModifiedPosition,PeptideUniqueToGene,ExperimentDesc,ExpID,PubmedID,ScoreType,IdentScore,LocProb,Log2FChange,PQ-val,QuantSig,PEP,MassErrorPPM
KLENPDKR,ac,K,73,true,"Quantitative Acetylproteomics",101,29440448,,,,,,,,
ASPHPILASHNHILSAPETR,nt,A,79,true,"Mitochondrial intermediate peptidases - icp55 / WT",131a,25732537,,92.9200000,,-6.6438562,,,,
ASPHPILASHNHILSAPETR,nt,A,79,true,"Mitochondrial intermediate peptidases - oct1-1 / WT",131b,25732537,,121.4800000,,-0.6281951,,,,
ASPHPILASHNHILSAPETR,nt,A,79,true,"Mitochondrial intermediate peptidases - oct1-2 / WT",131c,25732537,,100.0900000,,-0.7625555,,,,
YASPHPILASHNHILSAPETR,ph,S,80,true,"Tissue atlas Arabidopsis - ProteomicsDB",114,32188942,"MaxQuant score",140.9000000,0.9999910,,,,3.4413299683798E-23,
SHNHILSAPETR,nt,S,87,true,"Arabidopsis translation initiation landscape - NT",167b,35069635,,,,,,,,
SDETNGTAHFLE,nt,S,133,true,"N-terminal ChaFRADIC",92,26010716,"MASCOT Score",28.7100000,,,,,5.0350001401966E-5,
ILQNSKFEEQR,nt,I,200,true,"HUNTER N-terminome: legumain, GluC and trypsin",119,31951383,"MaxQuant score",58.6760000,,,,,,
TILGPAQNVKSITR,ac,K,259,true,"Quantitative Acetylproteomics",101,29440448,,,,,,,,
EDLQNYIKTHYTASR,ac,K,271,true,"Quantitative Acetylproteomics",101,29440448,,,,,,,,
QVKKLFTKLSSDPTTTSQLVANEPASFTGSE,nt,Q,295,true,"HUNTER N-terminome: legumain, GluC and trypsin",119,31951383,"MaxQuant score",92.6320000,,,,,,
HEEVVEQVKK,ac,K,297,true,"Quantitative Acetylproteomics",101,29440448,,,,,,,,
SWTDPDSVAL,nt,S,346,true,"N-terminal ChaFRADIC",92,26010716,"MASCOT Score",38.2300000,,,,,5.6250000852742E-6,
NVGGGKHVGSDLTQR,ac,K,373,true,"Quantitative Acetylproteomics",101,29440448,,,,,,,,
ADCLDDLSYAIMYEVTK,ox,C,415,true,"SPEAR - 10 mM H2O2 / mock",138a,34619326,,,,2.6506645,0.0364636,YES,,
SSLLLHMDGTSPIAEDIGR,nt,S,448,true,"Arabidopsis translation initiation landscape - NT",167b,35069635,,,,,,,,
GTSPIAEDIGR,nt,G,456,true,"Arg/N-end rule seed, prt6 vs. Wt",99,29168982,"MASCOT Score",47.9600000,,-1.4082956,0.0125232,YES,0.0062540001235902,-0.1964539
SSLLLHMDGTSPIAEDIGR,ph,S,458,true,"Tissue atlas Arabidopsis - ProteomicsDB",114,32188942,"MaxQuant score",73.7350000,0.7938470,,,,5.6771099480102E-5,
IDAVDASTVKR,ph,S,490,true,"Tissue atlas Arabidopsis - ProteomicsDB",114,32188942,"MaxQuant score",86.2140000,0.7881870,,,,0.00012655800674111,
IDAVDASTVKR,ac,K,493,true,"Quantitative Acetylproteomics",101,29440448,,,,,,,,
IDAVDASTVKR,ub,K,493,true,"Arabidopsis ubiquitination COFRADIC",40,26744219,"MaxQuant Score",82.4890000,1.0000000,,,,0.00033919999259524,-0.2430000
