Peptide,PTM,ModifiedAA,ModifiedPosition,PeptideUniqueToGene,ExperimentDesc,ExpID,PubmedID,ScoreType,IdentScore,LocProb,Log2FChange,PQ-val,QuantSig,PEP,MassErrorPPM
MESLIKSQHAQQLAGHK,ub,K,6,true,"upl3 mutant / wildtype",168,35926874,"MaxQuant score",111.6400000,1.0000000,-0.2722973,,,3.5061700209837E-9,0.3201400
MESLIKSQHAQQLAGHK,ph,S,7,true,"Tissue atlas Arabidopsis - ProteomicsDB",114,32188942,"MaxQuant score",41.5420000,0.9733520,,,,0.0044077099300921,
LIQQTHSPDAR,ph,S,52,true,"atm and atr DNA damage response",88,25561503,"MASCOT Score",46.0000000,1.0000000,,,,,0.3100000
SVTACVVELSELPDR,ph,S,207,true,"srk2dei ABA signaling phopshoproteomics",83,23572148,"MASCOT Score",20.0000000,,,,,,0.0051000
SVTACVVELSELPDR,ph,T,209,true,"srk2dei ABA signaling phopshoproteomics",83,23572148,"MASCOT Score",20.0000000,,,,,,0.0051000
SVTACVVELSELPDR,ph,S,216,true,"srk2dei ABA signaling phopshoproteomics",83,23572148,"MASCOT Score",20.0000000,,,,,,0.0051000
KFEDLRDPMPWYSVDSPKLIER,ub,K,438,true,"upl3 mutant / wildtype",168,35926874,"MaxQuant score",90.4750000,1.0000000,0.1775989,0.6776800,NO,6.4552402534446E-8,1.7506000
ATAKDSNVNLEMAYVGK,ub,K,548,true,"upl3 mutant / wildtype",168,35926874,"MaxQuant score",52.5690000,1.0000000,0.5449799,,,0.00083283300045878,0.2432200
DSNVNLEMAYVGKR,ac,K,561,true,"Quantitative Acetylproteomics",101,29440448,,,,,,,,
ETGKPCGHFDFHITAR,ub,K,689,true,"upl3 mutant / wildtype",168,35926874,"MaxQuant score",59.7280000,1.0000000,0.2750070,0.2135400,NO,0.00030896998941898,-1.2207000
YMSFSCCHDEK,ph,S,723,true,"Tissue atlas Arabidopsis - ProteomicsDB",114,32188942,"MaxQuant score",80.1700000,0.9991530,,,,0.00068787398049608,
