Peptide,PTM,ModifiedAA,ModifiedPosition,PeptideUniqueToGene,ExperimentDesc,ExpID,PubmedID,ScoreType,IdentScore,LocProb,Log2FChange,PQ-val,QuantSig,PEP,MassErrorPPM
AQRFQLNSQTLPTA,nt,A,2,true,"Arg/N-end rule seed, prt6 vs. Wt",99,29168982,"MASCOT Score",46.5100000,,,,,3.0330000299728E-5,-1.5083647
AQRFQLNSQTLPTA,nta,A,2,true,"Arg/N-end rule seed, prt6 vs. Wt",99,29168982,"MASCOT Score",46.5100000,,,,,3.0330000299728E-5,-1.5083647
FQLNSQTLPTADPLKR,ph,S,9,true,"Tissue atlas Arabidopsis - ProteomicsDB",114,32188942,"MaxQuant score",130.0200000,0.9972660,,,,1.7458699375084E-8,
FQLNSQTLPTADPLKR,ph,T,11,true,"Tissue atlas Arabidopsis - ProteomicsDB",114,32188942,"MaxQuant score",155.4900000,0.9990780,,,,3.8832100105997E-14,
FQLNSQTLPTADPLKR,ph,T,14,true,"Tissue atlas Arabidopsis - ProteomicsDB",114,32188942,"MaxQuant score",144.8200000,0.9999630,,,,1.9427200126376E-10,
FQLNSQTLPTADPLKR,ac,K,19,true,"Quantitative Acetylproteomics",101,29440448,,,,,,,,
FQLNSQTLPTADPLKR,ub,K,19,true,"Ubiquitination Membrane Proteins",120,33585938,,,,,,,,
RVSLIPR,ph,S,22,true,"Tissue atlas Arabidopsis - ProteomicsDB",114,32188942,"MaxQuant score",86.8820000,1.0000000,,,,0.015937000513077,
RPLAPRSHEDNPFGGHTDDHHVAAPADHNK,ph,S,46,true,"TOR Kinase and ABA Receptor",100,29290610,XCorr,4.8311639,0.9942000,,,,2.94199999189E-5,
SHEDNPFGGHTDDHHVAAPADHNK,ph,S,46,true,"atm and atr DNA damage response",88,25561503,"MASCOT Score",25.0000000,1.0000000,,,,,1.3600000
SHEDNPFGGHTDDHHVAAPADHNK,ph,S,46,true,"TOR Kinase and ABA Receptor",100,29290610,XCorr,2.9097941,0.9247000,,,,0.011289999820292,
SHEDNPFGGHTDDHHVAAPADHNK,ph,S,46,true,"Tissue atlas Arabidopsis - ProteomicsDB",114,32188942,"MaxQuant score",213.6400000,1.0000000,,,,0,
SHEDNPFGGHTDDHHVAAPADHNK,ph,T,56,true,"Tissue atlas Arabidopsis - ProteomicsDB",114,32188942,"MaxQuant score",48.4220000,0.9323180,,,,0.00041694499668665,
VMDHNSENLGSIVPK,ph,S,75,true,"Large-scale phosphorylation discovery",44,23111157,XCorr,3.8050000,,,,,,
VMDHNSENLGSIVPK,ph,S,75,true,"atm and atr DNA damage response",88,25561503,"MASCOT Score",44.0000000,1.0000000,,,,,-1.1600000
VMDHNSENLGSIVPK,ph,S,75,true,"Tissue atlas Arabidopsis - ProteomicsDB",114,32188942,"MaxQuant score",195.4600000,1.0000000,,,,7.6860099908811E-35,
TAHYPHPSEEILDANIR,ph,T,85,true,"Tissue atlas Arabidopsis - ProteomicsDB",114,32188942,"MaxQuant score",175.3200000,0.9999990,,,,5.6008897078751E-23,
TAHYPHPSEEILDANIR,ph,S,92,true,"atm and atr DNA damage response",88,25561503,"MASCOT Score",54.0000000,1.0000000,,,,,-0.9000000
TAHYPHPSEEILDANIR,ph,S,92,true,"Tissue atlas Arabidopsis - ProteomicsDB",114,32188942,"MaxQuant score",189.1100000,1.0000000,,,,1.4341400185258E-31,
HSMVPKSLGPNSLGGR,ac,K,107,true,"Quantitative Acetylproteomics",101,29440448,,,,,,,,
SLGPNSLGGR,ph,S,108,true,"atm and atr DNA damage response",88,25561503,"MASCOT Score",36.0000000,1.0000000,,,,,0.2500000
SLGPNSLGGR,ph,S,113,true,"STN8 phosphoproteome",38,21768351,"MASCOT Score",47.7700000,,,,,,0.4108080
SLGPNSLGGR,ph,S,113,true,"atm and atr DNA damage response",88,25561503,"MASCOT Score",56.0000000,1.0000000,,,,,0.4900000
SLGPNSLGGR,ph,S,113,true,"TOR Kinase and ABA Receptor",100,29290610,XCorr,2.8285823,1.0000000,,,,0.0024900001008064,
SLGPNSLGGR,ph,S,113,true,"Lateral root-induction - NAA vs control",106,23328941,"MASCOT Score",21.0000000,,,,,,
SLGPNSLGGR,ph,S,113,true,"Tissue atlas Arabidopsis - ProteomicsDB",114,32188942,"MaxQuant score",166.1100000,1.0000000,,,,2.7368699306862E-7,
LLRPIDFLYHGAGVSKR,ac,K,449,true,"Quantitative Acetylproteomics",101,29440448,,,,,,,,
