Peptide,PTM,ModifiedAA,ModifiedPosition,PeptideUniqueToGene,ExperimentDesc,ExpID,PubmedID,ScoreType,IdentScore,LocProb,Log2FChange,PQ-val,QuantSig,PEP,MassErrorPPM
AATAAASVVRYAPE,nt,A,2,true,"Arg/N-end rule seed, prt6 vs. Wt",99,29168982,"MASCOT Score",60.7000000,,,,,2.0760000385422E-9,-1.2198929
AATAAASVVR,nt,A,2,true,"N-term acetylation drought responses",5,26184543,,,,,,,,
AATAAASVVR,nt,A,2,true,"Arg/N-end rule seed, prt6 vs. Wt",99,29168982,"MASCOT Score",65.9800000,,,,,0.006180000025779,-0.6497879
AATAAASVVRYAPED,nta,A,2,true,"HUNTER N-terminome: legumain, GluC and trypsin",119,31951383,"MaxQuant score",210.1500000,,,,,,
AATAAASVVRYAPE,nta,A,2,true,"Arg/N-end rule seed, prt6 vs. Wt",99,29168982,"MASCOT Score",60.7000000,,,,,2.0760000385422E-9,-1.2198929
AATAAASVVR,nta,A,2,true,"N-term acetylation drought responses",5,26184543,,,,,,,,
AATAAASVVR,nta,A,2,true,"Characterization plant N-terminal acetylation",6,22223895,"MASCOT Score",76.0500000,,,,,,
AATAAASVVR,nta,A,2,true,"Arg/N-end rule pathway Roots",80,25728785,"MASCOT Score",82.1200000,,,,,6.768999810447E-6,
AATAAASVVR,nta,A,2,true,"Arg/N-end rule seed, prt6 vs. Wt",99,29168982,"MASCOT Score",65.9800000,,,,,0.006180000025779,-0.6497879
AATAAASVVR,nta,A,2,true,"FtsH12 N-terminome: WT / FtsH12 knockdown miRNA",118,33216923,"MaxQuant score",220.2900000,,,,,0,
AATAAASVVR,nta,A,2,true,"HUNTER N-terminome: legumain, GluC and trypsin",119,31951383,"MaxQuant score",102.6200000,,,,,,
AATAAASVVR,nta,A,2,true,"Arabidopsis translation initiation landscape - NTA",167a,35069635,,,,,,,,
VPLPSSAPASELSPEAYSR,ph,S,133,true,"srk2dei ABA signaling phopshoproteomics",83,23572148,"MASCOT Score",78.0000000,,,,,,0.0009000
VPLPSSAPASELSPEAYSR,ph,S,133,true,"Lateral root-induction - NAA vs control",106,23328941,"MASCOT Score",55.0000000,,,,,,
VPLPSSAPASELSPEAYSR,ph,S,133,true,"Tissue atlas Arabidopsis - ProteomicsDB",114,32188942,"MaxQuant score",94.3840000,0.8965780,,,,2.9266300316522E-6,
VPLPSSAPASELSPEAYSRR,ph,S,136,true,"TOR Kinase and ABA Receptor",100,29290610,XCorr,2.7184758,0.8103000,,,,0.004848999902606,
VPLPSSAPASELSPEAYSR,ph,S,136,true,"Arabidopsis root NAA phosphoproteome",18a,27643528,"MaxQuant Score",48.0770000,0.8290000,,,,0.00052469997899607,0.4320000
VPLPSSAPASELSPEAYSR,ph,S,136,true,"Phosphorylation nuclei-enriched fractions",28,19245862,,,,,,,,
VPLPSSAPASELSPEAYSR,ph,S,136,true,"STN8 phosphoproteome",38,21768351,"MASCOT Score",44.9300000,,,,,,-1.7863900
VPLPSSAPASELSPEAYSR,ph,S,136,true,"srk2dei ABA signaling phopshoproteomics",83,23572148,"MASCOT Score",88.0000000,,,,,,-0.0020000
VPLPSSAPASELSPEAYSR,ph,S,136,true,"LAXIC - ABA stress",84a,23660473,XCorr,4.3900000,1.0000000,,,,1.9199999812258E-8,
VPLPSSAPASELSPEAYSR,ph,S,136,true,"SnRK2 protein kinase substrates",85,23776212,XCorr,4.6362963,1.0000000,,,,0.00094972498482093,
VPLPSSAPASELSPEAYSR,ph,S,136,true,"atm and atr DNA damage response",88,25561503,"MASCOT Score",40.0000000,1.0000000,,,,,0.0000000
VPLPSSAPASELSPEAYSR,ph,S,136,true,"Protein sumoylation and phosphorylation cross-talk",97,28419593,,,,,,,,
VPLPSSAPASELSPEAYSR,ph,S,136,true,"Lateral root-induction - NAA vs control",106,23328941,"MASCOT Score",71.0000000,,,,,,
VPLPSSAPASELSPEAYSR,ph,S,136,true,"Phospho cell culture sucrose/TOR",109,30833711,,,0.9773870,,,,,
VPLPSSAPASELSPEAYSR,ph,S,136,true,"Col-0 callus - FC Col-0 vs. Col-0 Xray",111a,31410901,,89.8500000,,0.8253188,0.0000000,NO,,1.3328165
VPLPSSAPASELSPEAYSR,ph,S,136,true,"Col-0 X-ray callus - FC Col-0 vs. Col-0 Xray",111b,31410901,,89.8500000,,0.8253188,0.0000000,NO,,1.3328165
VPLPSSAPASELSPEAYSR,ph,S,136,true,"atm callus - FC atm vs. atm Xray",111c,31410901,,89.8500000,,1.0460392,0.0000000,NO,,1.3328165
VPLPSSAPASELSPEAYSR,ph,S,136,true,"atm-3 X-ray callus - FC atm vs. atm Xray",111d,31410901,,89.8500000,,1.0460392,0.0000000,NO,,1.3328165
VPLPSSAPASELSPEAYSR,ph,S,136,true,"Tissue atlas Arabidopsis - ProteomicsDB",114,32188942,"MaxQuant score",290.8800000,0.9999980,,,,0,
GADIVVATPGR,ph,T,287,false,"Tissue atlas Arabidopsis - ProteomicsDB",114,32188942,"MaxQuant score",73.5020000,1.0000000,,,,0.0059371399693191,
GGDSGYGGRGSFASR,me1,R,567,true,"Arabidopsis protein methylome",123,31809900,"MaxQuant Score",78.1910000,1.0000000,,,,5.5735699788784E-7,0.2317300
GGDSGYGGRGSFASR,ph,S,569,true,"Tissue atlas Arabidopsis - ProteomicsDB",114,32188942,"MaxQuant score",54.2530000,0.7749960,,,,0.0012094300473109,
APPPSSTGSPPR,ph,S,600,true,"atm and atr DNA damage response",88,25561503,"MASCOT Score",60.0000000,0.9910000,,,,,-0.8200000
APPPSSTGSPPR,ph,S,600,true,"Protein sumoylation and phosphorylation cross-talk",97,28419593,,,,,,,,
APPPSSTGSPPR,ph,S,600,true,"Lateral root-induction - NAA vs control",106,23328941,"MASCOT Score",39.0000000,,,,,,
APPPSSTGSPPR,ph,S,601,true,"atm and atr DNA damage response",88,25561503,"MASCOT Score",74.0000000,0.9900000,,,,,-0.5700000
APPPSSTGSPPR,ph,T,602,true,"Lateral root-induction - NAA vs control",106,23328941,"MASCOT Score",40.0000000,,,,,,
FNRAPPPSSTGSPPR,ph,S,604,true,"STN8 phosphoproteome",38,21768351,"MASCOT Score",49.4600000,,,,,,0.2722100
FNRAPPPSSTGSPPR,ph,S,604,true,"Phosphoproteome ethylene-regulated time response",46,24043427,"MASCOT Score",46.0600000,,,,,,-8.9067000
APPPSSTGSPPR,ph,S,604,true,"Large-scale phosphorylation discovery",44,23111157,XCorr,2.8750000,,,,,,
APPPSSTGSPPR,ph,S,604,true,"Chloroplast kinase substrates",60,19376835,"MASCOT Score",33.8900000,,,,,,0.4227310
APPPSSTGSPPR,ph,S,604,true,"SnRK2 protein kinase substrates",85,23776212,XCorr,2.1542649,0.9920000,,,,0.00029875698965043,
APPPSSTGSPPR,ph,S,604,true,"atm and atr DNA damage response",88,25561503,"MASCOT Score",74.0000000,1.0000000,,,,,-0.5700000
APPPSSTGSPPR,ph,S,604,true,"TOR Kinase and ABA Receptor",100,29290610,XCorr,3.2211287,0.8814000,,,,6.95300013831E-6,
APPPSSTGSPPR,ph,S,604,true,"Lateral root-induction - NAA vs control",106,23328941,"MASCOT Score",44.0000000,,,,,,
APPPSSTGSPPR,ph,S,604,true,"Col-0 callus - FC Col-0 vs. Col-0 Xray",111a,31410901,,53.4900000,,-0.1555987,0.0000000,NO,,0.0507944
APPPSSTGSPPR,ph,S,604,true,"Col-0 X-ray callus - FC Col-0 vs. Col-0 Xray",111b,31410901,,53.4900000,,-0.1555987,0.0000000,NO,,0.0507944
APPPSSTGSPPR,ph,S,604,true,"atm callus - FC atm vs. atm Xray",111c,31410901,,53.4900000,,-1.0398646,0.0000000,NO,,0.0507944
APPPSSTGSPPR,ph,S,604,true,"atm-3 X-ray callus - FC atm vs. atm Xray",111d,31410901,,53.4900000,,-1.0398646,0.0000000,NO,,0.0507944
APPPSSTGSPPR,ph,S,604,true,"Tissue atlas Arabidopsis - ProteomicsDB",114,32188942,"MaxQuant score",191.4800000,0.9923560,,,,2.8614600106267E-24,
APPPSSTGSPPRSFHETMMMK,ph,S,608,true,"TOR Kinase and ABA Receptor",100,29290610,XCorr,2.5207455,0.9833000,,,,0.018060000613332,
