Peptide,PTM,ModifiedAA,ModifiedPosition,PeptideUniqueToGene,ExperimentDesc,ExpID,PubmedID,ScoreType,IdentScore,LocProb,Log2FChange,PQ-val,QuantSig,PEP,MassErrorPPM
GTEAYDEAIE,nt,G,2,true,"N-term acetylation drought responses",5,26184543,,,,,,,,
GTEAYDEAIE,nt,G,2,true,"N-terminal ChaFRADIC",92,26010716,"MASCOT Score",60.1800000,,,,,0.00035359998582862,
GTEAYDEAIE,nta,G,2,true,"N-term acetylation drought responses",5,26184543,,,,,,,,
GTEAYDEAIE,nta,G,2,true,"N-terminal ChaFRADIC",92,26010716,"MASCOT Score",34.8200000,,,,,0.071170002222061,
TEAYDEAIE,nt,T,3,true,"N-terminal ChaFRADIC",92,26010716,"MASCOT Score",65.9400000,,,,,0.0042699999175966,
GTEAYDEAIEALKK,ub,K,14,true,"upl3 mutant / wildtype",168,35926874,"MaxQuant score",95.9810000,1.0000000,0.6396952,,,6.0188499446667E-6,0.3647900
KLLIEKEELK,ub,K,15,true,"upl3 mutant / wildtype",168,35926874,"MaxQuant score",107.0600000,1.0000000,0.5753123,0.0504770,NO,0.00037438998697326,0.1945500
LLIEKEELK,ac,K,20,true,"Histone deacetylases - apicidin vs control",98a,29061669,"MaxQuant Score",60.4000000,1.0000000,0.1330000,0.6053409,NO,0.0089999996125698,
AAKVEQITAALQTGTSSD,nt,A,28,true,"HUNTER N-terminome: legumain, GluC and trypsin",119,31951383,"MaxQuant score",289.7200000,,,,,,
AKVEQITAALQTGTSSD,nt,A,29,true,"HUNTER N-terminome: legumain, GluC and trypsin",119,31951383,"MaxQuant score",194.7000000,,,,,,
TVAAAKVEQITAALQTGTSSDKK,ac,K,30,true,"Quantitative Acetylproteomics",101,29440448,,,,,,,,
KVEQITAALQTGTSSD,nt,K,30,true,"HUNTER N-terminome: legumain, GluC and trypsin",119,31951383,"MaxQuant score",152.4000000,,,,,,
TVAAAKVEQITAALQTGTSSDKK,ub,K,30,true,"upl3 mutant / wildtype",168,35926874,"MaxQuant score",96.3410000,1.0000000,-0.0908029,0.8488200,NO,2.2257200527065E-8,0.3779200
QITAALQTGTSSDKKAFDPVE,nt,Q,33,true,"HUNTER N-terminome: legumain, GluC and trypsin",119,31951383,"MaxQuant score",57.0090000,,,,,,
ALQTGTSSDKKAFDPVE,nt,A,37,true,"HUNTER N-terminome: legumain, GluC and trypsin",119,31951383,"MaxQuant score",238.4700000,,,,,,
ALQTGTSSDKKAFD,nt,A,37,true,"HUNTER N-terminome: legumain, GluC and trypsin",119,31951383,"MaxQuant score",91.0320000,,,,,,
ALQTGTSSDKKAFDPVE,nta,A,37,true,"HUNTER N-terminome: legumain, GluC and trypsin",119,31951383,"MaxQuant score",82.2020000,,,,,,
ALQTGTSSDKKAFD,nta,A,37,true,"HUNTER N-terminome: legumain, GluC and trypsin",119,31951383,"MaxQuant score",69.7210000,,,,,,
ALQTGTSSDK,nta,A,37,true,"Characterization plant N-terminal acetylation",6,22223895,"MASCOT Score",68.4800000,,,,,,
VEQITAALQTGTSSDKK,ph,S,43,true,"Tissue atlas Arabidopsis - ProteomicsDB",114,32188942,"MaxQuant score",243.2600000,0.8853780,,,,0,
VEQITAALQTGTSSDKK,ph,S,44,true,"atm and atr DNA damage response",88,25561503,"MASCOT Score",79.0000000,0.9510000,,,,,0.7800000
VEQITAALQTGTSSDKK,ph,S,44,true,"Tissue atlas Arabidopsis - ProteomicsDB",114,32188942,"MaxQuant score",315.2600000,0.8628250,,,,0,
VEQITAALQTGTSSDKK,ub,K,46,true,"upl3 mutant / wildtype",168,35926874,"MaxQuant score",158.4500000,1.0000000,0.2904244,0.4778200,NO,2.3074699495534E-16,0.4718000
KAFDPVETIK,ac,K,47,true,"Histone deacetylases - apicidin vs control",98a,29061669,"MaxQuant Score",59.2000000,1.0000000,-0.2370000,0.4436086,NO,0.012000000104308,
KAFDPVETIK,ac,K,47,true,"Histone deacetylases- hda14 vs WT (low light)",98c,29061669,"MaxQuant Score",96.7500000,1.0000000,0.1820000,0.9931160,NO,0.0080000003799796,
KAFDPVETIK,ub,K,47,true,"upl3 mutant / wildtype",168,35926874,"MaxQuant score",143.0000000,1.0000000,0.1940871,0.8160800,NO,4.6366898459382E-5,0.0377990
AFDPVETIKQGFIK,ph,T,54,true,"Tissue atlas Arabidopsis - ProteomicsDB",114,32188942,"MaxQuant score",88.5960000,1.0000000,,,,0.00019561800581869,
AFDPVETIKQGFIK,ac,K,56,true,"Histone deacetylases substrates - TSA vs control",98b,29061669,"MaxQuant Score",153.1000000,1.0000000,0.4580000,0.9977001,NO,2.6000000306073E-15,
AFDPVETIKQGFIK,ac,K,56,true,"Histone deacetylases- hda14 vs WT (low light)",98c,29061669,"MaxQuant Score",216.1500000,1.0000000,-0.5440000,0.9885531,NO,5.8000002036809E-18,
AFDPVETIKQGFIK,cr,K,56,true,"Open search Plant PTM Viewer 2.0 - Crotonylation",164c,TBA,,,,,,,,
QGFIKFKK,ac,K,61,true,"Quantitative Acetylproteomics",101,29440448,,,,,,,,
QGFIKFK,ac,K,61,true,"Histone deacetylases - apicidin vs control",98a,29061669,"MaxQuant Score",125.3000000,1.0000000,0.2220000,0.3539973,NO,0.00031999999191612,
QGFIKFK,ac,K,61,true,"Histone deacetylases substrates - TSA vs control",98b,29061669,"MaxQuant Score",125.3000000,1.0000000,-0.0840000,0.9977001,NO,0.00031999999191612,
QGFIKFK,ac,K,61,true,"Histone deacetylases substrates - hda14 vs WT",98e,29061669,"MaxQuant Score",94.7000000,1.0000000,0.2510000,0.6180164,NO,0.0099999997764826,
QGFIKFK,ac,K,61,true,"Quantitative Acetylproteomics",101,29440448,,,,,,,,
KEKYETNPALYGELAK,ub,K,64,false,"upl3 mutant / wildtype",168,35926874,"MaxQuant score",122.0100000,0.9960000,-0.4880260,0.2493200,NO,6.9900700339076E-8,0.3651600
EKYETNPALYGELAK,ac,K,66,false,"Histone deacetylases - apicidin vs control",98a,29061669,"MaxQuant Score",203.1000000,1.0000000,0.2520000,0.2027683,NO,0,
EKYETNPALYGELAK,ac,K,66,false,"Histone deacetylases substrates - TSA vs control",98b,29061669,"MaxQuant Score",203.1000000,1.0000000,0.2160000,0.9794900,NO,0,
EKYETNPALYGELAK,ac,K,66,false,"Histone deacetylases- hda14 vs WT (low light)",98c,29061669,"MaxQuant Score",259.5300000,1.0000000,0.9590000,0.3265878,NO,4.0000001089808E-27,
EKYETNPALYGELAK,ac,K,66,false,"Histone deacetylases substrates - hda14 vs WT",98e,29061669,"MaxQuant Score",129.1000000,1.0000000,0.1360000,0.8709636,NO,2.4000000076106E-28,
EKYETNPALYGELAK,ac,K,66,false,"Quantitative Acetylproteomics",101,29440448,,,,,,,,
EKYETNPALYGELAK,ub,K,66,false,"upl3 mutant / wildtype",168,35926874,"MaxQuant score",67.6480000,1.0000000,,,,0.00014501900295727,-0.0555520
EKYETNPALYGELAK,ph,Y,74,false,"Tissue atlas Arabidopsis - ProteomicsDB",114,32188942,"MaxQuant score",70.5230000,0.9960500,,,,0.00051749497652054,
EKYETNPALYGELAKGQSPK,ac,K,79,false,"Histone deacetylases- hda14 vs WT (low light)",98c,29061669,"MaxQuant Score",160.9500000,1.0000000,-0.3520000,0.9885531,NO,8.2999995765221E-12,
EKYETNPALYGELAKGQSPK,ac,K,79,false,"Quantitative Acetylproteomics",101,29440448,,,,,,,,
YETNPALYGELAKGQSPK,ac,K,79,false,"Histone deacetylases - apicidin vs control",98a,29061669,"MaxQuant Score",152.6000000,1.0000000,0.1360000,0.4017908,NO,7.0999998471097E-38,
YETNPALYGELAKGQSPK,ac,K,79,false,"Histone deacetylases substrates - hda14 vs WT",98e,29061669,"MaxQuant Score",54.3000000,1.0000000,0.1740000,0.8912509,NO,0.00023000000510365,
EKYETNPALYGELAK,ac,K,79,false,"Quantitative Acetylproteomics",101,29440448,,,,,,,,
EKYETNPALYGELAKGQSPK,cr,K,79,false,"Open search Plant PTM Viewer 2.0 - Crotonylation",164c,TBA,,,,,,,,
EKYETNPALYGELAKGQSPK,hib,K,79,false,"Open search Plant PTM Viewer 2.0 - hib",164e,TBA,,,,,,,,
KGQSPKYMVFACSDSR,nt,K,79,false,"HUNTER N-terminome: legumain, GluC and trypsin",119,31951383,"MaxQuant score",85.1600000,,,,,,
YETNPALYGELAKGQSPK,ub,K,79,false,"upl3 mutant / wildtype",168,35926874,"MaxQuant score",217.3300000,1.0000000,-1.1015981,0.4749200,NO,1.4012984643248E-45,0.6953400
EKYETNPALYGELAKGQSPK,ph,S,82,false,"Phosphoproteome ethylene-regulated time response",46,24043427,"MASCOT Score",66.0700000,,,,,,-3.9990000
YMVFACSDSR,ox,C,90,false,"SPEAR - 50 mM H2O2 / mock",138b,34619326,,,,1.1883677,0.0118683,YES,,
YMVFACSDSR,sno,C,90,false,"Cold stress nitrosylation - 4°C vs 22°C",65,24388526,,,,1.6322682,,NO,,
YMVFACSDSR,sno,C,90,false,"S-Nitroso-Proteome guard cells - 60 min flg22",116c,32121556,,,,-0.5353317,0.0210000,YES,,
VCPSHVLDFQPGDAFVVR,nt,V,95,true,"Stromal N-terminome",96,26371235,"MASCOT Score",49.4000000,,,,,,
VCPSHVLDFQPGDAFVVR,sno,C,96,true,"Cold stress nitrosylation - 4°C vs 22°C",65,24388526,,,,1.6780719,,NO,,
VCPSHVLDFQPGDAFVVR,sno,C,96,true,"Site-specific nitrosomeproteomic id - gsnor1-3",90a,25699590,XCorr,5.0817995,,,,,0.0042570000514388,-3.5104019
VCPSHVLDFQPGDAFVVR,sno,C,96,true,"Site-specific nitrosomeproteomic id - gsnor1-3",90b,25699590,XCorr,5.6873345,,,,,0.00033549999352545,-5.9897069
VCPSHVLDFQPGDAFVVR,sno,C,96,true,"S-Nitroso-Proteome guard cells - 30 min flg22",116b,32121556,,,,-1.0291463,0.0470000,YES,,
VCPSHVLDFQPGDAFVVR,sno,C,96,true,"hot5-4 / wildtype, FAT-switch S-nitrosoproteome",169,37277371,,,,-0.1664896,0.1521729,NO,,
NIANMVPPFDKVK,ac,K,123,false,"Histone deacetylases - apicidin vs control",98a,29061669,"MaxQuant Score",81.0000000,1.0000000,0.2780000,0.1196741,NO,2.3000000510365E-5,
NIANMVPPFDKVK,ac,K,123,false,"Histone deacetylases substrates - TSA vs control",98b,29061669,"MaxQuant Score",81.0000000,1.0000000,-0.0110000,0.9977001,NO,2.3000000510365E-5,
NIANMVPPFDKVK,ac,K,123,false,"Histone deacetylases substrates - hda14 vs WT",98e,29061669,"MaxQuant Score",44.5000000,1.0000000,0.0080000,0.9931160,NO,0.0049999998882413,
NIANMVPPFDKVK,ac,K,123,false,"Quantitative Acetylproteomics",101,29440448,,,,,,,,
NIANMVPPFDKVK,ub,K,123,false,"upl3 mutant / wildtype",168,35926874,"MaxQuant score",89.7470000,1.0000000,0.9523336,0.0447040,YES,1.9762599549722E-5,-1.3591000
VKYGGVGAAIEYAVLHLK,ac,K,125,true,"Histone deacetylases substrates - TSA vs control",98b,29061669,"MaxQuant Score",148.4000000,1.0000000,-0.2530000,0.9794900,NO,2.1999999787645E-31,
VENIVVIGHSACGGIK,sno,C,153,false,"Cold stress nitrosylation - 4°C vs 22°C",65,24388526,,,,,,,,
VENIVVIGHSACGGIK,sno,C,153,false,"Site-specific nitrosomeproteomic id - gsnor1-3",90a,25699590,XCorr,3.9826021,,,,,8.1560003195591E-8,-5.6301930
VENIVVIGHSACGGIK,sno,C,153,false,"Site-specific nitrosomeproteomic id - gsnor1-3",90b,25699590,XCorr,3.6506922,,,,,0.018389999866486,-6.5843181
SFPLDGNNSTDFIE,nt,S,161,false,"Arg/N-end rule seed, prt6 vs. Wt",99,29168982,"MASCOT Score",27.9000000,,-1.5056599,0.0081090,YES,0.0071279997937381,-3.0326878
SFPLDGNNSTDFIE,nt,S,161,false,"HUNTER N-terminome: legumain, GluC and trypsin",119,31951383,"MaxQuant score",69.9790000,,,,,,
ICLPAK,sno,C,180,false,"Cold stress nitrosylation - 4°C vs 22°C",65,24388526,,,,1.3785116,,NO,,
ICLPAK,sno,C,180,false,"hot5-4 / wildtype, FAT-switch S-nitrosoproteome",169,37277371,,,,,,,,
SKVISELGDSAFEDQCGR,nt,S,185,true,"HUNTER N-terminome: legumain, GluC and trypsin",119,31951383,"MaxQuant score",46.1500000,,,,,,
SKVISELGDSAFEDQCGR,ac,K,186,true,"Histone deacetylases - apicidin vs control",98a,29061669,"MaxQuant Score",40.4000000,1.0000000,1.4360000,0.3689776,NO,0.0010000000474975,
SKVISELGDSAFEDQCGR,ub,K,186,true,"upl3 mutant / wildtype",168,35926874,"MaxQuant score",85.5100000,1.0000000,0.1029940,0.8354200,NO,4.6147900434335E-7,0.9629800
VISELGDSAFEDQCGR,nt,V,187,true,"Stromal N-terminome",96,26371235,"MASCOT Score",39.0800000,,,,,,
VISELGDSAFEDQCGR,ph,S,189,true,"Tissue atlas Arabidopsis - ProteomicsDB",114,32188942,"MaxQuant score",280.5000000,1.0000000,,,,0,
VISELGDSAFEDQCGR,ph,S,194,true,"Tissue atlas Arabidopsis - ProteomicsDB",114,32188942,"MaxQuant score",50.9500000,0.9888330,,,,0.0042596301063895,
SKVISELGDSAFEDQCGR,ox,C,200,true,"SPEAR - 50 mM H2O2 / mock",138b,34619326,,,,4.4031965,0.0372388,YES,,
VISELGDSAFEDQCGR,sno,C,200,true,"Cold stress nitrosylation - 4°C vs 22°C",65,24388526,,,,1.2630344,,NO,,
EAVNVSLANLLTYPFVR,nt,E,206,false,"Stromal N-terminome",96,26371235,"MASCOT Score",74.5200000,,,,,,
EAVNVSLANLLTYPFVR,nt,E,206,false,"HUNTER N-terminome: legumain, GluC and trypsin",119,31951383,"MaxQuant score",41.0920000,,,,,,
EGLVKGTLALK,hib,K,227,true,"Open search Plant PTM Viewer 2.0 - hib",164e,TBA,,,,,,,,
GTLALKGGYYDFVK,ac,K,233,true,"Histone deacetylases - apicidin vs control",98a,29061669,"MaxQuant Score",128.7000000,1.0000000,0.3000000,0.1218990,NO,5.2000000612146E-15,
GTLALKGGYYDFVK,ac,K,233,true,"Histone deacetylases substrates - TSA vs control",98b,29061669,"MaxQuant Score",128.7000000,1.0000000,1.0500000,0.9506048,NO,5.2000000612146E-15,
GTLALKGGYYDFVK,ac,K,233,true,"Histone deacetylases- hda14 vs WT (low light)",98c,29061669,"MaxQuant Score",187.3700000,1.0000000,-0.3940000,0.9885531,NO,2.4999999900105E-12,
GTLALKGGYYDFVK,ub,K,233,true,"upl3 mutant / wildtype",168,35926874,"MaxQuant score",111.8300000,1.0000000,0.0635029,0.8391600,NO,9.5981204140116E-6,0.3331900
DVATILHWKL,ac,K,269,true,"Histone deacetylases- hda14 vs WT (low light)",98c,29061669,"MaxQuant Score",157.3800000,1.0000000,5.8490000,0.0835603,NO,0.00030000001424924,
