Peptide,PTM,ModifiedAA,ModifiedPosition,PeptideUniqueToGene,ExperimentDesc,ExpID,PubmedID,ScoreType,IdentScore,LocProb,Log2FChange,PQ-val,QuantSig,PEP,MassErrorPPM
VLISGPPIKDPEALLR,nt,V,93,true,"N-terminal ChaFRADIC",92,26010716,"MASCOT Score",35.3700000,,,,,4.0259999423142E-7,
VLISGPPIKDPEALLR,nt,V,93,true,"Stromal N-terminome",96,26371235,"MASCOT Score",114.4300000,,,,,,
VLISGPPIKDPEALLR,nt,V,93,true,"HUNTER N-terminome: legumain, GluC and trypsin",119,31951383,"MaxQuant score",91.6570000,,,,,,
VLISGPPIKDPEALLR,nt,V,93,true,"Arabidopsis translation initiation landscape - NT",167b,35069635,,,,,,,,
VLISGPPIKDPE,nt,V,93,true,"N-terminal ChaFRADIC",92,26010716,"MASCOT Score",22.0300000,,,,,4.9610000132816E-5,
VLISGPPIKDPE,nt,V,93,true,"Stromal N-terminome",96,26371235,"MASCOT Score",68.2200000,,,,,,
VLISGPPIKDPE,nt,V,93,true,"Arg/N-end rule seed, prt6 vs. Wt",99,29168982,"MASCOT Score",24.6500000,,-0.0133560,0.9278398,NO,9.2520003818208E-6,-2.5320525
VLISGPPIKDPE,nt,V,93,true,"HUNTER N-terminome: legumain, GluC and trypsin",119,31951383,"MaxQuant score",93.3450000,,,,,,
SIIVAGFAESK,ph,S,159,true,"Tissue atlas Arabidopsis - ProteomicsDB",114,32188942,"MaxQuant score",59.1550000,0.9999860,,,,0.010305100120604,
DHGNEMIEK,mox,M,176,true,"cat2 Methionine oxidation - 3h stress",62b,25693801,"MASCOT Score",38.0000000,,0.0599304,,NO,,
LEAGMQDMLK,mox,M,184,true,"cat2 Methionine oxidation - 3h stress",62b,25693801,"MASCOT Score",65.0000000,,0.3519372,,NO,,
LEAGMQDMLK,mox,M,187,true,"cat2 Methionine oxidation - 3h stress",62b,25693801,"MASCOT Score",65.0000000,,0.3519372,,NO,,
DAVAPKQK,ac,K,202,true,"Quantitative Acetylproteomics",101,29440448,,,,,,,,
GRASVDMK,ph,S,240,true,"atm and atr DNA damage response",88,25561503,"MASCOT Score",34.0000000,1.0000000,,,,,-0.0300000
GRASVDMK,mox,M,243,true,"cat2 Methionine oxidation - 1h stress",62a,25693801,"MASCOT Score",49.0000000,,0.3118389,,NO,,
GRASVDMK,mox,M,243,true,"cat2 Methionine oxidation - 3h stress",62b,25693801,"MASCOT Score",46.0000000,,-0.2010365,,NO,,
IKDNPNIEDCVFR,sno,C,256,true,"Site-specific nitrosomeproteomic id - gsnor1-3",90a,25699590,XCorr,3.7892282,,,,,9.9830003819079E-6,-5.1763438
IKDNPNIEDCVFR,sno,C,256,true,"Site-specific nitrosomeproteomic id - gsnor1-3",90b,25699590,XCorr,3.7100000,,,,,0.050850000232458,-4.7500000
DNPNIEDCVFR,sno,C,256,true,"hot5-4 / wildtype, FAT-switch S-nitrosoproteome",169,37277371,,,,,,,,
YAVFGYVTDNEDFLADLK,ph,T,401,true,"SnRK2 protein kinase substrates",85,23776212,XCorr,3.0733275,1.0000000,,,,3.5045200519335E-8,
SIQVVSGLE,nt,S,418,true,"N-terminal ChaFRADIC",92,26010716,"MASCOT Score",42.5300000,,,,,0.00026760000037029,
