Peptide,PTM,ModifiedAA,ModifiedPosition,PeptideUniqueToGene,ExperimentDesc,ExpID,PubmedID,ScoreType,IdentScore,LocProb,Log2FChange,PQ-val,QuantSig,PEP,MassErrorPPM
LILDMNASPPSDAEGYGAEETSDSRK,ph,S,155,true,"SnRK2 protein kinase substrates",85,23776212,XCorr,3.0800567,0.9840000,,,,0.025485500693321,
LILDMNASPPSDAEGYGAEETSDSRK,ph,S,155,true,"TOR Kinase and ABA Receptor",100,29290610,XCorr,6.3802528,1.0000000,,,,5.6030000905594E-7,
LILDMNASPPSDAEGYGAEETSDSRK,ph,S,155,true,"Tissue atlas Arabidopsis - ProteomicsDB",114,32188942,"MaxQuant score",100.5900000,0.9448870,,,,5.9562502148783E-22,
LILDMNASPPSDAEGYGAEETSDSRK,ph,S,158,true,"SnRK2 protein kinase substrates",85,23776212,XCorr,3.0800567,0.9840000,,,,0.025485500693321,
LILDMNASPPSDAEGYGAEETSDSRK,ph,S,158,true,"TOR Kinase and ABA Receptor",100,29290610,XCorr,6.3802528,0.9993000,,,,5.6030000905594E-7,
SEVDSSRVDFDK,ph,S,550,true,"srk2dei ABA signaling phopshoproteomics",83,23572148,"MASCOT Score",31.0000000,,,,,,-0.0001000
NTSASELK,ph,S,850,true,"atm and atr DNA damage response",88,25561503,"MASCOT Score",31.0000000,0.9550000,,,,,-1.8000000
DYRKLECLSAEMK,ub,K,1267,true,"Ubiquitylome analysis innate immunity",124,33793954,,,,,,,,
NQGKSPLETDTQPGESHVNFGESK,ph,S,1504,true,"Tissue atlas Arabidopsis - ProteomicsDB",114,32188942,"MaxQuant score",203.4500000,0.9999990,,,,0,
SPLETDTQPGESHVNFGESK,ph,S,1522,true,"Tissue atlas Arabidopsis - ProteomicsDB",114,32188942,"MaxQuant score",127.8900000,0.9957010,,,,6.9095699376019E-18,
ISSPETISSPGR,ph,S,1526,true,"LAXIC - mannitol vs control",84b,23660473,XCorr,2.4800000,0.9930000,,,,0.00042755898903124,
ISSPETISSPGR,ph,S,1526,true,"Tissue atlas Arabidopsis - ProteomicsDB",114,32188942,"MaxQuant score",244.7500000,0.9997180,,,,0,
ISSPETISSPGR,ph,S,1531,true,"Tissue atlas Arabidopsis - ProteomicsDB",114,32188942,"MaxQuant score",213.2600000,0.8293050,,,,0,
ISSPETISSPGRHELPIADTSPLVTDNLPEKDTSETLLK,ph,S,1532,true,"Tissue atlas Arabidopsis - ProteomicsDB",114,32188942,"MaxQuant score",254.1500000,0.9479620,,,,0,
ISSPETISSPGR,ph,S,1532,true,"LAXIC - mannitol vs control",84b,23660473,XCorr,2.4800000,0.9970000,,,,0.00042755898903124,
HELPIADTSPLVTDNLPEKDTSETLLK,ph,S,1544,true,"Tissue atlas Arabidopsis - ProteomicsDB",114,32188942,"MaxQuant score",159.4200000,0.8644530,,,,0,
TFASDDEFEDHTESK,ph,S,1815,true,"Tissue atlas Arabidopsis - ProteomicsDB",114,32188942,"MaxQuant score",121.4500000,0.9999970,,,,3.1742199553264E-6,
DVAEISNVSELDSGLIR,ph,S,1876,true,"Tissue atlas Arabidopsis - ProteomicsDB",114,32188942,"MaxQuant score",242.1800000,0.9999990,,,,0,
YQEEESISPYHFEEICSK,ph,S,1888,true,"Tissue atlas Arabidopsis - ProteomicsDB",114,32188942,"MaxQuant score",188.8600000,0.9992540,,,,1.5828599307222E-36,
SVTDSHGGPLDKPSGLGFGFSEQK,ph,S,1980,true,"Tissue atlas Arabidopsis - ProteomicsDB",114,32188942,"MaxQuant score",221.7700000,0.9881130,,,,0,
SCCVVPQAALKR,ph,S,2010,true,"srk2dei ABA signaling phopshoproteomics",83,23572148,"MASCOT Score",27.0000000,,,,,,-0.0004000
SQPVSDSQER,ph,S,2154,true,"atm and atr DNA damage response",88,25561503,"MASCOT Score",27.0000000,1.0000000,,,,,-2.4200000
SQPVSDSQER,ph,S,2156,true,"atm and atr DNA damage response",88,25561503,"MASCOT Score",43.0000000,0.9400000,,,,,-1.8800000
