Peptide,PTM,ModifiedAA,ModifiedPosition,PeptideUniqueToGene,ExperimentDesc,ExpID,PubmedID,ScoreType,IdentScore,LocProb,Log2FChange,PQ-val,QuantSig,PEP,MassErrorPPM
GSTMEDEKDAFYIVR,ph,S,3,true,"Tissue atlas Arabidopsis - ProteomicsDB",114,32188942,"MaxQuant score",107.6900000,0.8427200,,,,1.3774899798591E-6,
SLSECQGQAGSSVSHPAMSVYK,ph,S,28,true,"Tissue atlas Arabidopsis - ProteomicsDB",114,32188942,"MaxQuant score",116.4800000,0.9947180,,,,5.1890498310307E-16,
LIPCPVQQPSSSQGESLNK,ph,S,95,true,"Tissue atlas Arabidopsis - ProteomicsDB",114,32188942,"MaxQuant score",261.5900000,0.9299360,,,,0,
LIPCPVQQPSSSQGESLNK,ph,S,99,true,"Tissue atlas Arabidopsis - ProteomicsDB",114,32188942,"MaxQuant score",105.5000000,0.9824660,,,,8.5708702981486E-17,
LQDMGSGESGSFSPSPPQK,ph,S,121,true,"Tissue atlas Arabidopsis - ProteomicsDB",114,32188942,"MaxQuant score",353.1400000,0.9990130,,,,0,
LQDMGSGESGSFSPSPPQK,ph,S,123,true,"Tissue atlas Arabidopsis - ProteomicsDB",114,32188942,"MaxQuant score",281.9500000,1.0000000,,,,0,
RIPSSLLTR,ph,S,141,true,"atm and atr DNA damage response",88,25561503,"MASCOT Score",43.0000000,0.9330000,,,,,0.0100000
IPSSLLTR,ph,S,141,true,"atm and atr DNA damage response",88,25561503,"MASCOT Score",22.0000000,0.9940000,,,,,-0.7900000
IPSSLLTR,ph,S,141,true,"Tissue atlas Arabidopsis - ProteomicsDB",114,32188942,"MaxQuant score",136.2700000,0.9784580,,,,7.5397496402729E-5,
