Peptide,PTM,ModifiedAA,ModifiedPosition,PeptideUniqueToGene,ExperimentDesc,ExpID,PubmedID,ScoreType,IdentScore,LocProb,Log2FChange,PQ-val,QuantSig,PEP,MassErrorPPM
GNLFCCVLVK,myr,G,2,true,"N-Terminal Myristoylated Proteins",102,29453228,,,,,,,,
LQQLDVQCETK,acy,C,58,true,"Arabidopsis S-acylation atlas - Meristem",163a,35681017,,,,,,,,
LQQLDVQCETK,acy,C,58,true,"Arabidopsis S-acylation atlas - Hypocotyl",163b,35681017,,,,,,,,
LQQLDVQCETK,sno,C,58,true,"hot5-4 / wildtype, FAT-switch S-nitrosoproteome",169,37277371,,,,-0.8670831,0.0315897,YES,,
LQQLDVQCETK,ph,T,60,true,"Phosphorylation in N starvation",63,22060019,"MASCOT Score",99.0000000,,,,,,5.1194400
VLADKASDAFYR,ac,K,82,true,"Quantitative Acetylproteomics",101,29440448,,,,,,,,
VLADKASDAFYR,ub,K,82,true,"Ubiquitination Membrane Proteins",120,33585938,,,,,,,,
ACVPKLNLDDVFEQK,ub,K,111,true,"upl3 mutant / wildtype",168,35926874,"MaxQuant score",93.2430000,1.0000000,0.4308205,0.1889570,NO,1.8089100422003E-6,1.3637000
VAASEKAEAEKIIQIK,ub,K,177,true,"Ubiquitination Membrane Proteins",120,33585938,,,,,,,,
VAASEKAEAEK,ub,K,177,true,"Ubiquitination Membrane Proteins",120,33585938,,,,,,,,
AEAEKIIQIK,ac,K,182,true,"Quantitative Acetylproteomics",101,29440448,,,,,,,,
RAEGEAESKYLSGLGIAR,ub,K,196,false,"Ubiquitination Membrane Proteins",120,33585938,,,,,,,,
AEGEAESKYLSGLGIAR,ub,K,196,false,"Ubiquitination Membrane Proteins",120,33585938,,,,,,,,
YLSGLGIAR,ph,S,199,false,"Phosphorylation Early Elicitor Signaling",23,17317660,,,,,,,,
YLSGLGIAR,ph,S,199,false,"atm and atr DNA damage response",88,25561503,"MASCOT Score",48.0000000,1.0000000,,,,,0.4700000
YLSGLGIAR,ph,S,199,false,"Tissue atlas Arabidopsis - ProteomicsDB",114,32188942,"MaxQuant score",113.4600000,0.9999980,,,,0.00044134398922324,
DIGATSKSSAVFIPHGPGAVSDVAAQIR,ub,K,254,true,"Ubiquitination Membrane Proteins",120,33585938,,,,,,,,
DIGATSKSSAVFIPHGPGAVSDVAAQIR,ub,K,254,true,"upl3 mutant / wildtype",168,35926874,"MaxQuant score",70.7180000,1.0000000,2.3978030,,,2.5184901386588E-10,-2.0079000
SSAVFIPHGPGAVSDVAAQIR,ph,S,268,true,"TOR Kinase and ABA Receptor",100,29290610,XCorr,2.6877759,1.0000000,,,,0.00010409999958938,
SSAVFIPHGPGAVSDVAAQIR,ph,S,268,true,"Tissue atlas Arabidopsis - ProteomicsDB",114,32188942,"MaxQuant score",90.1660000,0.9993610,,,,1.0031099861862E-7,
