Peptide,PTM,ModifiedAA,ModifiedPosition,PeptideUniqueToGene,ExperimentDesc,ExpID,PubmedID,ScoreType,IdentScore,LocProb,Log2FChange,PQ-val,QuantSig,PEP,MassErrorPPM
FSSAHTDPKFR,ub,K,44,true,"Arabidopsis ubiquitination COFRADIC",40,26744219,"MaxQuant Score",87.1840000,1.0000000,,,,0.00018180000188295,-0.0008850
FATGSAPVDKR,ph,S,74,true,"Tissue atlas Arabidopsis - ProteomicsDB",114,32188942,"MaxQuant score",99.9910000,0.9943620,,,,1.671079917287E-5,
FATGSAPVDKR,ub,K,79,true,"Arabidopsis ubiquitination COFRADIC",40,26744219,"MaxQuant Score",85.8130000,1.0000000,,,,0.0020000000949949,0.2180000
TGGTGKDSLR,ub,K,90,true,"Arabidopsis ubiquitination COFRADIC",40,26744219,"MaxQuant Score",54.2590000,1.0000000,,,,0.025000000372529,0.5030000
QKTEEESGDESGSETEINDLK,ph,S,111,true,"Brassinosteroid-Regulated Phosphorylation Dynamics",94,26187819,"MaxQuant Score",78.9870000,0.8380000,,,,0.012000000104308,1.7350000
TEEESGDESGSETEINDLK,ph,S,111,true,"TOR Kinase and ABA Receptor",100,29290610,XCorr,5.7752409,1.0000000,,,,1.7829999706009E-5,
TEEESGDESGSETEINDLK,ph,S,111,true,"Phospho cell culture sucrose/TOR",109,30833711,,,0.9449200,,,,,
QKTEEESGDESGSETEINDLK,ph,S,115,true,"Brassinosteroid-Regulated Phosphorylation Dynamics",94,26187819,"MaxQuant Score",78.9870000,0.8260000,,,,0.012000000104308,1.7350000
TEEESGDESGSETEINDLK,ph,S,115,true,"TOR Kinase and ABA Receptor",100,29290610,XCorr,5.7752409,0.9121000,,,,1.7829999706009E-5,
QKTEEESGDESGSETEINDLK,ph,S,117,true,"Brassinosteroid-Regulated Phosphorylation Dynamics",94,26187819,"MaxQuant Score",78.9870000,0.8030000,,,,0.012000000104308,1.7350000
TEEESGDESGSETEINDLK,ph,S,117,true,"TOR Kinase and ABA Receptor",100,29290610,XCorr,5.7752409,0.9121000,,,,1.7829999706009E-5,
SSHVESEEESESELK,ph,S,129,true,"srk2dei ABA signaling phopshoproteomics",83,23572148,"MASCOT Score",20.0000000,,,,,,-0.0020000
SSHVESEEESESELK,ph,S,130,true,"srk2dei ABA signaling phopshoproteomics",83,23572148,"MASCOT Score",20.0000000,,,,,,-0.0020000
SSHVESEEESESELK,ph,S,134,true,"Arabidopsis root NAA phosphoproteome",18a,27643528,"MaxQuant Score",85.7370000,1.0000000,,,,3.5820001187403E-8,0.8730000
SSHVESEEESESELK,ph,S,134,true,"STN8 phosphoproteome",38,21768351,"MASCOT Score",42.5500000,,,,,,
SSHVESEEESESELK,ph,S,134,true,"Tyrosine phosphorylation in Arabidopsis",59,18463617,"MASCOT Score",38.0000000,,,,,,-0.7844467
SSHVESEEESESELK,ph,S,134,true,"srk2dei ABA signaling phopshoproteomics",83,23572148,"MASCOT Score",52.0000000,,,,,,-0.0007000
SSHVESEEESESELK,ph,S,134,true,"LAXIC - ABA stress",84a,23660473,XCorr,4.7300000,1.0000000,,,,0.021886300295591,
SSHVESEEESESELK,ph,S,134,true,"LAXIC - mannitol vs control",84b,23660473,XCorr,5.6300000,1.0000000,,,,0.00024212300195359,
SSHVESEEESESELK,ph,S,134,true,"SnRK2 protein kinase substrates",85,23776212,XCorr,5.5404739,1.0000000,,,,0.0027232500724494,
SSHVESEEESESELK,ph,S,134,true,"atm and atr DNA damage response",88,25561503,"MASCOT Score",31.0000000,1.0000000,,,,,-1.4500000
SSHVESEEESESELK,ph,S,134,true,"Brassinosteroid-Regulated Phosphorylation Dynamics",94,26187819,"MaxQuant Score",241.3800000,1.0000000,,,,0,0.4450000
SSHVESEEESESELK,ph,S,134,true,"TOR Kinase and ABA Receptor",100,29290610,XCorr,6.2410116,1.0000000,,,,1.7430000298191E-5,
SSHVESEEESESELK,ph,S,134,true,"Lateral root-induction - NAA vs control",106,23328941,"MASCOT Score",35.0000000,,,,,,
SSHVESEEESESELK,ph,S,134,true,"Phospho cell culture sucrose/TOR",109,30833711,,,0.9999790,,,,,
SSHVESEEESESELK,ph,S,134,true,"Col-0 callus - FC Col-0 vs. Col-0 Xray",111a,31410901,,43.4600000,,0.1644734,0.0000000,NO,,1.0461338
SSHVESEEESESELK,ph,S,134,true,"Col-0 X-ray callus - FC Col-0 vs. Col-0 Xray",111b,31410901,,43.4600000,,0.1644734,0.0000000,NO,,1.0461338
SSHVESEEESESELK,ph,S,134,true,"atm callus - FC atm vs. atm Xray",111c,31410901,,43.4600000,,-0.9515154,0.0000000,NO,,1.0461338
SSHVESEEESESELK,ph,S,134,true,"atm-3 X-ray callus - FC atm vs. atm Xray",111d,31410901,,43.4600000,,-0.9515154,0.0000000,NO,,1.0461338
SSHVESEEESESELK,ph,S,134,true,"Tissue atlas Arabidopsis - ProteomicsDB",114,32188942,"MaxQuant score",372.9300000,1.0000000,,,,0,
SSHVESEEESESELK,ph,S,138,true,"Arabidopsis root NAA phosphoproteome",18a,27643528,"MaxQuant Score",85.7370000,0.9880000,,,,3.5820001187403E-8,0.8730000
SSHVESEEESESELK,ph,S,138,true,"Tyrosine phosphorylation in Arabidopsis",59,18463617,"MASCOT Score",60.0000000,,,,,,-0.9525425
SSHVESEEESESELK,ph,S,138,true,"Conserved plant phosphoproteome - Arabidopsis",61a,20466843,"MASCOT Score",43.0000000,1.0000000,,,,,
SSHVESEEESESELK,ph,S,138,true,"srk2dei ABA signaling phopshoproteomics",83,23572148,"MASCOT Score",52.0000000,,,,,,-0.0007000
SSHVESEEESESELK,ph,S,138,true,"LAXIC - ABA stress",84a,23660473,XCorr,4.7300000,1.0000000,,,,0.021886300295591,
SSHVESEEESESELK,ph,S,138,true,"LAXIC - mannitol vs control",84b,23660473,XCorr,5.6300000,1.0000000,,,,0.00024212300195359,
SSHVESEEESESELK,ph,S,138,true,"SnRK2 protein kinase substrates",85,23776212,XCorr,4.7501206,1.0000000,,,,0.003091299906373,
SSHVESEEESESELK,ph,S,138,true,"atm and atr DNA damage response",88,25561503,"MASCOT Score",31.0000000,0.9930000,,,,,-1.4500000
SSHVESEEESESELK,ph,S,138,true,"Brassinosteroid-Regulated Phosphorylation Dynamics",94,26187819,"MaxQuant Score",241.3800000,1.0000000,,,,0,0.4450000
SSHVESEEESESELK,ph,S,138,true,"TOR Kinase and ABA Receptor",100,29290610,XCorr,6.2410116,0.9991000,,,,1.7430000298191E-5,
SSHVESEEESESELK,ph,S,138,true,"Lateral root-induction - NAA vs control",106,23328941,"MASCOT Score",35.0000000,,,,,,
SSHVESEEESESELK,ph,S,138,true,"Col-0 callus - FC Col-0 vs. Col-0 Xray",111a,31410901,,43.4600000,,0.1644734,0.0000000,NO,,1.0461338
SSHVESEEESESELK,ph,S,138,true,"Col-0 X-ray callus - FC Col-0 vs. Col-0 Xray",111b,31410901,,43.4600000,,0.1644734,0.0000000,NO,,1.0461338
SSHVESEEESESELK,ph,S,138,true,"atm callus - FC atm vs. atm Xray",111c,31410901,,43.4600000,,-0.9515154,0.0000000,NO,,1.0461338
SSHVESEEESESELK,ph,S,138,true,"atm-3 X-ray callus - FC atm vs. atm Xray",111d,31410901,,43.4600000,,-0.9515154,0.0000000,NO,,1.0461338
SSHVESEEESESELK,ph,S,138,true,"Tissue atlas Arabidopsis - ProteomicsDB",114,32188942,"MaxQuant score",372.9300000,0.9999990,,,,0,
SSHVESEEESESELK,ph,S,140,true,"TOR Kinase and ABA Receptor",100,29290610,XCorr,5.9393082,1.0000000,,,,0.0002983000013046,
VASLDDESDEK,ph,S,146,true,"Tissue atlas Arabidopsis - ProteomicsDB",114,32188942,"MaxQuant score",114.2100000,1.0000000,,,,2.4627099264762E-5,
VASLDDESDEK,ph,S,151,true,"TOR Kinase and ABA Receptor",100,29290610,XCorr,3.9091432,1.0000000,,,,6.5320000430802E-6,
VASLDDESDEK,ph,S,151,true,"Tissue atlas Arabidopsis - ProteomicsDB",114,32188942,"MaxQuant score",203.8800000,1.0000000,,,,2.1592000583656E-24,
KNDASDDEDEEEEEDEDVINQK,ph,S,265,true,"srk2dei ABA signaling phopshoproteomics",83,23572148,"MASCOT Score",56.0000000,,,,,,-0.0004000
KNDASDDEDEEEEEDEDVINQK,ph,S,265,true,"LAXIC - mannitol vs control",84b,23660473,XCorr,4.0200000,1.0000000,,,,3.0199998946046E-6,
KNDASDDEDEEEEEDEDVINQK,ph,S,265,true,"Brassinosteroid-Regulated Phosphorylation Dynamics",94,26187819,"MaxQuant Score",108.7100000,1.0000000,,,,4.2070001654793E-5,1.6870000
KNDASDDEDEEEEEDEDVINQK,ph,S,265,true,"TOR Kinase and ABA Receptor",100,29290610,XCorr,6.4558959,1.0000000,,,,5.3349999973307E-8,
NDASDDEDEEEEEDEDVINQK,ph,S,265,true,"LAXIC - ABA stress",84a,23660473,XCorr,6.8700000,1.0000000,,,,1.8099999721244E-8,
NDASDDEDEEEEEDEDVINQK,ph,S,265,true,"LAXIC - mannitol vs control",84b,23660473,XCorr,6.8900000,1.0000000,,,,2.1399999241112E-5,
NDASDDEDEEEEEDEDVINQK,ph,S,265,true,"SnRK2 protein kinase substrates",85,23776212,XCorr,5.9853511,1.0000000,,,,0.0022152899764478,
NDASDDEDEEEEEDEDVINQK,ph,S,265,true,"atm and atr DNA damage response",88,25561503,"MASCOT Score",121.0000000,1.0000000,,,,,-0.1100000
NDASDDEDEEEEEDEDVINQK,ph,S,265,true,"TOR Kinase and ABA Receptor",100,29290610,XCorr,6.4095755,1.0000000,,,,2.5499999889433E-9,
NDASDDEDEEEEEDEDVINQK,ph,S,265,true,"Lateral root-induction - NAA vs control",106,23328941,"MASCOT Score",95.0000000,,,,,,
NDASDDEDEEEEEDEDVINQK,ph,S,265,true,"Col-0 callus - FC Col-0 vs. Col-0 Xray",111a,31410901,,62.5900000,,0.3853191,0.0000000,NO,,1.2250293
NDASDDEDEEEEEDEDVINQK,ph,S,265,true,"Col-0 X-ray callus - FC Col-0 vs. Col-0 Xray",111b,31410901,,62.5900000,,0.3853191,0.0000000,NO,,1.2250293
NDASDDEDEEEEEDEDVINQK,ph,S,265,true,"atm callus - FC atm vs. atm Xray",111c,31410901,,62.5900000,,-1.8294166,0.0000000,NO,,1.2250293
NDASDDEDEEEEEDEDVINQK,ph,S,265,true,"atm-3 X-ray callus - FC atm vs. atm Xray",111d,31410901,,62.5900000,,-1.8294166,0.0000000,NO,,1.2250293
VNLSWDEDEPHR,ph,S,369,true,"Tissue atlas Arabidopsis - ProteomicsDB",114,32188942,"MaxQuant score",212.0300000,1.0000000,,,,1.2347299796984E-31,
EFLASDESDSDEEDDLGNEVINQSK,ph,S,401,true,"SnRK2 protein kinase substrates",85,23776212,XCorr,4.5120587,0.9990000,,,,7.3120901333823E-7,
EFLASDESDSDEEDDLGNEVINQSK,ph,S,406,true,"SnRK2 protein kinase substrates",85,23776212,XCorr,4.5120587,0.9900000,,,,7.3120901333823E-7,
ALIEAEDVDSDKDLEEENDQDMEVTFNTGLEDLSK,ph,S,441,true,"Arabidopsis root NAA phosphoproteome",18a,27643528,"MaxQuant Score",87.3570000,1.0000000,,,,3.4090000267106E-10,0.2190000
ALIEAEDVDSDKDLEEENDQDMEVTFNTGLEDLSK,ph,S,441,true,"SnRK2 protein kinase substrates",85,23776212,XCorr,4.4810400,1.0000000,,,,0.0016419700114056,
ALIEAEDVDSDKDLEEENDQDMEVTFNTGLEDLSK,ph,S,441,true,"Phospho cell culture sucrose/TOR",109,30833711,,,0.9917330,,,,,
ALIEAEDVDSDK,ph,S,441,true,"srk2dei ABA signaling phopshoproteomics",83,23572148,"MASCOT Score",72.0000000,,,,,,-0.0002000
ALIEAEDVDSDK,ph,S,441,true,"TOR Kinase and ABA Receptor",100,29290610,XCorr,4.3843036,1.0000000,,,,5.2659999028037E-7,
ALIEAEDVDSDK,ph,S,441,true,"Tissue atlas Arabidopsis - ProteomicsDB",114,32188942,"MaxQuant score",180.4800000,1.0000000,,,,1.1242400405785E-19,
QKDDDSSPDDDDDYNIDRK,ph,S,503,true,"srk2dei ABA signaling phopshoproteomics",83,23572148,"MASCOT Score",78.0000000,,,,,,-0.0005000
QKDDDSSPDDDDDYNIDRK,ph,S,503,true,"SnRK2 protein kinase substrates",85,23776212,XCorr,3.2323165,0.8000000,,,,0.0026511698961258,
QKDDDSSPDDDDDYNIDRK,ph,S,503,true,"Brassinosteroid-Regulated Phosphorylation Dynamics",94,26187819,"MaxQuant Score",157.6800000,1.0000000,,,,1.7210000091694E-10,0.8990000
QKDDDSSPDDDDDYNIDRK,ph,S,503,true,"TOR Kinase and ABA Receptor",100,29290610,XCorr,2.8856401,1.0000000,,,,0.00068599998485297,
QKDDDSSPDDDDDYNIDRK,ph,S,503,true,"Tissue atlas Arabidopsis - ProteomicsDB",114,32188942,"MaxQuant score",238.7000000,1.0000000,,,,0,
DDDSSPDDDDDYNIDRK,ph,S,503,true,"TOR Kinase and ABA Receptor",100,29290610,XCorr,5.0223408,1.0000000,,,,1.2689999948634E-6,
QKDDDSSPDDDDDYNIDRK,ph,S,504,true,"srk2dei ABA signaling phopshoproteomics",83,23572148,"MASCOT Score",78.0000000,,,,,,-0.0005000
QKDDDSSPDDDDDYNIDRK,ph,S,504,true,"Brassinosteroid-Regulated Phosphorylation Dynamics",94,26187819,"MaxQuant Score",157.6800000,1.0000000,,,,1.7210000091694E-10,0.8990000
QKDDDSSPDDDDDYNIDRK,ph,S,504,true,"TOR Kinase and ABA Receptor",100,29290610,XCorr,2.8856401,1.0000000,,,,0.00068599998485297,
DDDSSPDDDDDYNIDRK,ph,S,504,true,"TOR Kinase and ABA Receptor",100,29290610,XCorr,5.0223408,1.0000000,,,,1.2689999948634E-6,
QKDDDSSPDDDDDYNIDRK,ph,Y,511,true,"LAXIC - mannitol vs control",84b,23660473,XCorr,2.6000000,0.9040000,,,,3.360000055963E-10,
EKQELNSDGNLGSK,ph,S,656,true,"Tissue atlas Arabidopsis - ProteomicsDB",114,32188942,"MaxQuant score",223.3800000,1.0000000,,,,0,
