Peptide,PTM,ModifiedAA,ModifiedPosition,PeptideUniqueToGene,ExperimentDesc,ExpID,PubmedID,ScoreType,IdentScore,LocProb,Log2FChange,PQ-val,QuantSig,PEP,MassErrorPPM
SSSGQTQFRYT,nt,S,2,true,"Arg/N-end rule seed, prt6 vs. Wt",99,29168982,"MASCOT Score",43.8300000,,,,,0.00052110000979155,-1.4906783
SSSGQTQFR,nt,S,2,true,"Arg/N-end rule seed, prt6 vs. Wt",99,29168982,"MASCOT Score",84.3600000,,,,,0.074060000479221,0.1635901
SSSGQTQFRYT,nta,S,2,true,"Arg/N-end rule seed, prt6 vs. Wt",99,29168982,"MASCOT Score",43.8300000,,,,,0.00052110000979155,-1.4906783
SSSGQTQFR,nta,S,2,true,"Characterization plant N-terminal acetylation",6,22223895,"MASCOT Score",71.8600000,,,,,,
SSSGQTQFR,nta,S,2,true,"Arg/N-end rule seed, prt6 vs. Wt",99,29168982,"MASCOT Score",84.3600000,,,,,0.074060000479221,0.1635901
SSSGQTQFR,nta,S,2,true,"Arabidopsis translation initiation landscape - NTA",167a,35069635,,,,,,,,
IVNTKSNVGANR,ac,K,47,true,"Quantitative Acetylproteomics",101,29440448,,,,,,,,
SRHTDLNVKAF,nt,S,320,true,"Arabidopsis translation initiation landscape - NT",167b,35069635,,,,,,,,
