Peptide,PTM,ModifiedAA,ModifiedPosition,PeptideUniqueToGene,ExperimentDesc,ExpID,PubmedID,ScoreType,IdentScore,LocProb,Log2FChange,PQ-val,QuantSig,PEP,MassErrorPPM
SDPDLVGSPVGGSSR,ph,S,31,true,"Tissue atlas Arabidopsis - ProteomicsDB",114,32188942,"MaxQuant score",51.1470000,0.9266240,,,,0.0064392099156976,
AVSSAASAAAASSAAAAPVAAAPPVVLK,nta,A,115,true,"Characterization plant N-terminal acetylation",6,22223895,"MASCOT Score",80.0000000,,,,,,
AASAAAASSAAAAPVAAAPPVVLK,nta,A,119,true,"Characterization plant N-terminal acetylation",6,22223895,"MASCOT Score",77.0300000,,,,,,
AAASSAAAAPVAAAPPVVLK,nta,A,123,true,"Characterization plant N-terminal acetylation",6,22223895,"MASCOT Score",43.0200000,,,,,,
AASSAAAAPVAAAPPVVLK,nta,A,124,true,"Characterization plant N-terminal acetylation",6,22223895,"MASCOT Score",78.2500000,,,,,,
SVDEEVVVAEEGIR,nt,S,143,true,"Arg/N-end rule seed, prt6 vs. Wt",99,29168982,"MASCOT Score",45.0600000,,0.0710016,0.5760687,NO,0.028610000386834,1.4060577
TAELIDFKEK,ac,K,217,true,"Histone deacetylases substrates - hda14 vs WT",98e,29061669,"MaxQuant Score",60.3000000,1.0000000,0.9840000,0.1294196,NO,0.0040000001899898,
SVSFEYGR,ph,S,223,true,"Tissue atlas Arabidopsis - ProteomicsDB",114,32188942,"MaxQuant score",112.0100000,0.9999450,,,,0.003544420003891,
CVDIELVSK,ox,C,334,true,"OxiTRAQ Arabidopsis - 5 mM H2O2 versus control",47,24376095,,,,-0.0386134,0.6129601,NO,,
CVDIELVSK,so,C,334,true,"S-sulfenylation site detection using YAP1C",110,32714340,,,,,,,,
YIGGHNDVLAGCICGSLK,ox,C,391,true,"SPEAR - 10 mM H2O2 / mock",138a,34619326,,,,1.2794163,0.0396129,YES,,
