Peptide,PTM,ModifiedAA,ModifiedPosition,PeptideUniqueToGene,ExperimentDesc,ExpID,PubmedID,ScoreType,IdentScore,LocProb,Log2FChange,PQ-val,QuantSig,PEP,MassErrorPPM
LQSSMLQNSDGGQTIDDVEDGALRR,ph,S,249,true,"TOR Kinase and ABA Receptor",100,29290610,XCorr,3.3190680,0.9913000,,,,0.00010910000128206,
LQSSMLQNSDGGQTIDDVEDGALRR,ph,S,249,true,"Tissue atlas Arabidopsis - ProteomicsDB",114,32188942,"MaxQuant score",88.0270000,0.9911080,,,,6.3238699216442E-13,
AFYGNHEANSSLQAEERSPK,ph,S,438,true,"atm and atr DNA damage response",88,25561503,"MASCOT Score",54.0000000,1.0000000,,,,,-0.7200000
AFYGNHEANSSLQAEERSPK,ph,S,438,true,"TOR Kinase and ABA Receptor",100,29290610,XCorr,5.4184632,0.9999000,,,,4.0739999462858E-7,
AFYGNHEANSSLQAEERSPK,ph,S,438,true,"Tissue atlas Arabidopsis - ProteomicsDB",114,32188942,"MaxQuant score",291.6400000,1.0000000,,,,0,
DTVVSATAQTSPSDIISSHDTFAVEESK,ph,S,451,true,"Tissue atlas Arabidopsis - ProteomicsDB",114,32188942,"MaxQuant score",290.1000000,0.9591300,,,,0,
LSGDMVNVAPSPVEK,ph,S,486,true,"srk2dei ABA signaling phopshoproteomics",83,23572148,"MASCOT Score",27.0000000,,,,,,0.0012000
LSGDMVNVAPSPVEK,ph,S,486,true,"SnRK2 protein kinase substrates",85,23776212,XCorr,3.2053769,1.0000000,,,,9.5236900961027E-5,
LSGDMVNVAPSPVEK,ph,S,486,true,"atm and atr DNA damage response",88,25561503,"MASCOT Score",36.0000000,1.0000000,,,,,-0.4500000
LSGDMVNVAPSPVEK,ph,S,486,true,"TOR Kinase and ABA Receptor",100,29290610,XCorr,5.1079369,1.0000000,,,,1.7669999579084E-6,
LSGDMVNVAPSPVEK,ph,S,486,true,"Lateral root-induction - NAA vs control",106,23328941,"MASCOT Score",40.0000000,,,,,,
LSGDMVNVAPSPVEK,ph,S,486,true,"Phospho cell culture sucrose/TOR",109,30833711,,,0.9999980,,,,,
LSGDMVNVAPSPVEK,ph,S,486,true,"Tissue atlas Arabidopsis - ProteomicsDB",114,32188942,"MaxQuant score",229.0200000,1.0000000,,,,0,
LSGDMVNVAPSPVEK,ph,S,486,true,"Touch-induced phosphorylation: 40s touch vs untouc",136,30291188,"MASCOT score",59.3100000,,-0.0441330,0.8115493,NO,,6.6138387
SHDGMSPSEACVQTVR,ph,S,496,true,"Large-scale phosphorylation discovery",44,23111157,XCorr,3.1400000,,,,,,
SHDGMSPSEACVQTVR,ph,S,496,true,"SnRK2 protein kinase substrates",85,23776212,XCorr,3.6187403,0.9990000,,,,9.3491500592791E-5,
SHDGMSPSEACVQTVR,ph,S,496,true,"atm and atr DNA damage response",88,25561503,"MASCOT Score",75.0000000,1.0000000,,,,,0.1800000
SHDGMSPSEACVQTVR,ph,S,496,true,"Tissue atlas Arabidopsis - ProteomicsDB",114,32188942,"MaxQuant score",241.1100000,0.9998420,,,,0,
SHDGMSPSEACVQTVR,ph,S,498,true,"Tissue atlas Arabidopsis - ProteomicsDB",114,32188942,"MaxQuant score",60.1340000,0.9257050,,,,0.000234551000176,
EYAMGWNELSKTPDDK,ph,T,520,true,"Tissue atlas Arabidopsis - ProteomicsDB",114,32188942,"MaxQuant score",424.6300000,1.0000000,,,,0,
IDACVAQVVQSEAIEHSPSSCLVVNK,ph,S,648,true,"Tissue atlas Arabidopsis - ProteomicsDB",114,32188942,"MaxQuant score",211.1500000,0.9434330,,,,0,
MSFSPAITADTPAR,ph,S,762,true,"Tissue atlas Arabidopsis - ProteomicsDB",114,32188942,"MaxQuant score",200.3900000,0.9999950,,,,3.1629601330384E-36,
MSFSPAITADTPAR,ph,T,769,true,"Tissue atlas Arabidopsis - ProteomicsDB",114,32188942,"MaxQuant score",179.0300000,0.9999880,,,,8.4367701936752E-22,
ILEENVSSSTAER,ph,S,1070,true,"Tissue atlas Arabidopsis - ProteomicsDB",114,32188942,"MaxQuant score",176.5600000,0.7955710,,,,7.5702399696595E-16,
