Peptide,PTM,ModifiedAA,ModifiedPosition,PeptideUniqueToGene,ExperimentDesc,ExpID,PubmedID,ScoreType,IdentScore,LocProb,Log2FChange,PQ-val,QuantSig,PEP,MassErrorPPM
MKSEMLNLR,ph,S,1385,true,"Tissue atlas Arabidopsis - ProteomicsDB",114,32188942,"MaxQuant score",72.6520000,1.0000000,,,,0.013711100444198,
MNSDSNFGVASPR,ph,S,1399,true,"atm and atr DNA damage response",88,25561503,"MASCOT Score",60.0000000,1.0000000,,,,,-0.1600000
MNSDSNFGVASPR,ph,S,1399,true,"Tissue atlas Arabidopsis - ProteomicsDB",114,32188942,"MaxQuant score",254.5600000,1.0000000,,,,0,
MNSDSNFGVASPR,ph,S,1401,true,"atm and atr DNA damage response",88,25561503,"MASCOT Score",35.0000000,0.9480000,,,,,0.1900000
MNSDSNFGVASPR,ph,S,1407,true,"atm and atr DNA damage response",88,25561503,"MASCOT Score",57.0000000,1.0000000,,,,,-0.2400000
MNSDSNFGVASPR,ph,S,1407,true,"Tissue atlas Arabidopsis - ProteomicsDB",114,32188942,"MaxQuant score",254.7100000,1.0000000,,,,0,
RKSPYLIPDSGAASPEIDGVVHR,ph,S,1418,true,"Tissue atlas Arabidopsis - ProteomicsDB",114,32188942,"MaxQuant score",101.0400000,0.9267020,,,,1.4753299493533E-12,
SPYLIPDSGAASPEIDGVVHR,ph,S,1425,true,"Tissue atlas Arabidopsis - ProteomicsDB",114,32188942,"MaxQuant score",80.6640000,0.9999810,,,,3.3182500374096E-6,
SPYLIPDSGAASPEIDGVVHR,ph,S,1429,true,"Tissue atlas Arabidopsis - ProteomicsDB",114,32188942,"MaxQuant score",189.3900000,0.9999960,,,,0,
STSLQSDR,ph,S,1574,true,"atm and atr DNA damage response",88,25561503,"MASCOT Score",26.0000000,0.9950000,,,,,-0.7900000
STSLQSDRSSDGTSFQIGR,ph,S,1577,true,"atm and atr DNA damage response",88,25561503,"MASCOT Score",28.0000000,0.9930000,,,,,0.1500000
STSLQSDR,ph,S,1577,true,"atm and atr DNA damage response",88,25561503,"MASCOT Score",26.0000000,0.9950000,,,,,-0.7900000
STSLQSDRSSDGTSFQIGR,ph,S,1580,true,"atm and atr DNA damage response",88,25561503,"MASCOT Score",28.0000000,0.9270000,,,,,0.1500000
SSDGTSFQIGR,ph,S,1580,true,"Tissue atlas Arabidopsis - ProteomicsDB",114,32188942,"MaxQuant score",156.1400000,0.9127430,,,,1.823030060244E-10,
VECRMNQLLR,cn,C,1805,true,"Cellular regulation by S-cyanylation",115,30377236,,,,,,,,
SLTPASDVAKEIRK,ph,S,1876,true,"srk2dei ABA signaling phopshoproteomics",83,23572148,"MASCOT Score",23.0000000,,,,,,-0.0023000
STLYRQFLTSEVSR,ph,Y,2045,true,"Tissue atlas Arabidopsis - ProteomicsDB",114,32188942,"MaxQuant score",48.4400000,0.8664860,,,,0.010696399956942,
STLYRQFLTSEVSR,ph,S,2051,true,"Tissue atlas Arabidopsis - ProteomicsDB",114,32188942,"MaxQuant score",48.4400000,0.8923540,,,,0.010696399956942,
