Peptide,PTM,ModifiedAA,ModifiedPosition,PeptideUniqueToGene,ExperimentDesc,ExpID,PubmedID,ScoreType,IdentScore,LocProb,Log2FChange,PQ-val,QuantSig,PEP,MassErrorPPM
SQFESLIPNSSLATTAMR,ng,N,124,true,"Conserved N-glycosylation",74,22633491,"MaxQuant Score",97.5390000,1.0000000,,,,2.6580000849208E-6,-4.0600000
SQFESLIPNSSLATTAMR,ng,N,124,true,"UDP-GlcNAc transporter glycopeptide analysis",135,30224661,,,,,,,0.00012565795623232,1.2000000
DTSLEAGTQSR,ph,S,250,true,"Tissue atlas Arabidopsis - ProteomicsDB",114,32188942,"MaxQuant score",116.0300000,0.9999000,,,,2.8794100217056E-5,
LDSMSESTTLVK,ph,S,261,true,"Plasmamembrane phosphorylation",20,15308754,,,,,,,,
LDSMSESTTLVK,ph,S,261,true,"Phosphorylation Early Elicitor Signaling",23,17317660,,,,,,,,
LDSMSESTTLVK,ph,S,261,true,"Tissue atlas Arabidopsis - ProteomicsDB",114,32188942,"MaxQuant score",200.9800000,0.9999960,,,,3.2618101124478E-26,
LDSMSESTTLVK,ph,S,263,true,"Tissue atlas Arabidopsis - ProteomicsDB",114,32188942,"MaxQuant score",79.8750000,0.9364370,,,,0.00042994899558835,
FNPEGMTHMSTR,ph,S,445,true,"Tissue atlas Arabidopsis - ProteomicsDB",114,32188942,"MaxQuant score",110.9700000,0.9072870,,,,6.301469693426E-5,
