Peptide,PTM,ModifiedAA,ModifiedPosition,PeptideUniqueToGene,ExperimentDesc,ExpID,PubmedID,ScoreType,IdentScore,LocProb,Log2FChange,PQ-val,QuantSig,PEP,MassErrorPPM
MEDSPQGLKR,nta,M,1,true,"Arabidopsis translation initiation landscape - NTA",167a,35069635,,,,,,,,
MEDSPQGLKR,ph,S,4,true,"atm and atr DNA damage response",88,25561503,"MASCOT Score",26.0000000,1.0000000,,,,,-0.5900000
MEDSPQGLKR,ph,S,4,true,"Phospho cell culture sucrose/TOR",109,30833711,,,1.0000000,,,,,
MEDSPQGLKR,ph,S,4,true,"Tissue atlas Arabidopsis - ProteomicsDB",114,32188942,"MaxQuant score",193.7300000,1.0000000,,,,9.4095297688539E-14,
MEDSPQGLK,ph,S,4,true,"atm and atr DNA damage response",88,25561503,"MASCOT Score",49.0000000,1.0000000,,,,,1.1700000
RSRDPDQDQDDDSGEAGK,ph,S,22,true,"TOR Kinase and ABA Receptor",100,29290610,XCorr,3.6031995,1.0000000,,,,0.0042610000818968,
SRDPDQDQDDDSGEAGK,ph,S,22,true,"Tissue atlas Arabidopsis - ProteomicsDB",114,32188942,"MaxQuant score",197.6900000,1.0000000,,,,3.4501103243433E-39,
SRDPDQDQDDDSGEAGKADGSGGENQER,ph,S,31,true,"SnRK2 protein kinase substrates",85,23776212,XCorr,3.8862782,0.9930000,,,,6.4407999766924E-11,
SSDQIELDDDDFQETRPKPK,ph,S,39,true,"Lateral root-induction - NAA vs control",106,23328941,"MASCOT Score",51.0000000,,-0.1388269,0.4624125,NO,,
SSDQIELDDDDFQETRPKPK,ph,S,39,true,"Col-0 callus - FC Col-0 vs. Col-0 Xray",111a,31410901,,35.7800000,,0.4903935,0.0000000,NO,,0.9754050
SSDQIELDDDDFQETRPKPK,ph,S,39,true,"Col-0 X-ray callus - FC Col-0 vs. Col-0 Xray",111b,31410901,,35.7800000,,0.4903935,0.0000000,NO,,0.9754050
SSDQIELDDDDFQETRPKPK,ph,S,39,true,"atm callus - FC atm vs. atm Xray",111c,31410901,,35.7800000,,0.5056648,0.0000000,NO,,0.9754050
SSDQIELDDDDFQETRPKPK,ph,S,39,true,"atm-3 X-ray callus - FC atm vs. atm Xray",111d,31410901,,35.7800000,,0.5056648,0.0000000,NO,,0.9754050
SSDQIELDDDDFQETRPK,ph,S,39,true,"Phospho cell culture sucrose/TOR",109,30833711,,,0.8808970,,,,,
SSDQIELDDDDFQETRPK,ph,S,39,true,"Tissue atlas Arabidopsis - ProteomicsDB",114,32188942,"MaxQuant score",338.7300000,0.9827550,,,,0,
SSDQIELDDDDFQETRPKPK,ph,S,40,true,"Col-0 callus - FC Col-0 vs. Col-0 Xray",111a,31410901,,68.4500000,,1.2152376,0.0000000,NO,,1.3670401
SSDQIELDDDDFQETRPKPK,ph,S,40,true,"Col-0 X-ray callus - FC Col-0 vs. Col-0 Xray",111b,31410901,,68.4500000,,1.2152376,0.0000000,NO,,1.3670401
SSDQIELDDDDFQETRPKPK,ph,S,40,true,"atm callus - FC atm vs. atm Xray",111c,31410901,,68.4500000,,0.8314668,0.0000000,NO,,1.3670401
SSDQIELDDDDFQETRPKPK,ph,S,40,true,"atm-3 X-ray callus - FC atm vs. atm Xray",111d,31410901,,68.4500000,,0.8314668,0.0000000,NO,,1.3670401
SSDQIELDDDDFQETRPK,ph,S,40,true,"Tissue atlas Arabidopsis - ProteomicsDB",114,32188942,"MaxQuant score",316.1200000,0.8598060,,,,0,
SSDQIELDDDDFQETRPKPK,ph,T,53,true,"Tissue atlas Arabidopsis - ProteomicsDB",114,32188942,"MaxQuant score",121.7200000,1.0000000,,,,4.2905299860776E-16,
FNSSPSSLTGHDDSSSEIHIFR,ph,S,424,true,"Tissue atlas Arabidopsis - ProteomicsDB",114,32188942,"MaxQuant score",172.6600000,0.9670490,,,,2.8025969286496E-45,
LCAEMFNTSDETDEEDENK,ph,S,811,true,"srk2dei ABA signaling phopshoproteomics",83,23572148,"MASCOT Score",70.0000000,,,,,,-0.0027000
LCAEMFNTSDETDEEDENKEYIEETNR,ph,T,814,true,"SnRK2 protein kinase substrates",85,23776212,XCorr,5.4077311,0.8320000,,,,6.4927501309403E-13,
LCAEMFNTSDETDEEDENK,ph,T,814,true,"Tyrosine phosphorylation in Arabidopsis",59,18463617,"MASCOT Score",72.0000000,,,,,,-0.9338505
LCAEMFNTSDETDEEDENK,ph,T,814,true,"srk2dei ABA signaling phopshoproteomics",83,23572148,"MASCOT Score",98.0000000,,,,,,-0.0012000
