Peptide,PTM,ModifiedAA,ModifiedPosition,PeptideUniqueToGene,ExperimentDesc,ExpID,PubmedID,ScoreType,IdentScore,LocProb,Log2FChange,PQ-val,QuantSig,PEP,MassErrorPPM
SIPGAPPVTPAGSFGR,ph,T,100,true,"LAXIC - ABA stress",84a,23660473,XCorr,2.5700000,0.9480000,,,,0.0048295399174094,
SIPGAPPVTPAGSFGR,ph,T,100,true,"SnRK2 protein kinase substrates",85,23776212,XCorr,2.3759155,0.9050000,,,,0.0098434202373028,
SIPGAPPVTPAGSFGR,ph,T,100,true,"atm and atr DNA damage response",88,25561503,"MASCOT Score",53.0000000,1.0000000,,,,,-1.7300000
SIPGAPPVTPAGSFGR,ph,T,100,true,"Phospho cell culture sucrose/TOR",109,30833711,,,0.8672750,,,,,
SIPGAPPVTPAGSFGR,ph,T,100,true,"Tissue atlas Arabidopsis - ProteomicsDB",114,32188942,"MaxQuant score",170.7800000,0.9999010,,,,8.4416702492575E-19,
SIPGAPPVTPAGSFGRK,ph,S,104,true,"TOR Kinase and ABA Receptor",100,29290610,XCorr,3.4578846,0.9791000,,,,0.077540002763271,
SIPGAPPVTPAGSFGR,ph,S,104,true,"STN8 phosphoproteome",38,21768351,"MASCOT Score",52.7900000,,,,,,-0.6768430
SIPGAPPVTPAGSFGR,ph,S,104,true,"Large-scale phosphorylation discovery",44,23111157,XCorr,2.5980000,,,,,,
SIPGAPPVTPAGSFGR,ph,S,104,true,"PAMP-triggered phosphorylation",48,24601666,"MASCOT Score",30.1700000,,,,,,
SIPGAPPVTPAGSFGR,ph,S,104,true,"Tyrosine phosphorylation in Arabidopsis",59,18463617,"MASCOT Score",41.0000000,,,,,,-1.8241776
SIPGAPPVTPAGSFGR,ph,S,104,true,"Chloroplast kinase substrates",60,19376835,"MASCOT Score",51.9600000,,,,,,-0.6768430
SIPGAPPVTPAGSFGR,ph,S,104,true,"srk2dei ABA signaling phopshoproteomics",83,23572148,"MASCOT Score",40.0000000,,,,,,-0.0007000
SIPGAPPVTPAGSFGR,ph,S,104,true,"atm and atr DNA damage response",88,25561503,"MASCOT Score",67.0000000,0.9490000,,,,,-0.2400000
SIPGAPPVTPAGSFGR,ph,S,104,true,"Phospho cell culture sucrose/TOR",109,30833711,,,0.9449280,,,,,
SIPGAPPVTPAGSFGR,ph,S,104,true,"Tissue atlas Arabidopsis - ProteomicsDB",114,32188942,"MaxQuant score",179.0300000,0.9999940,,,,2.3132600325532E-26,
KMTVDDLIAR,ph,T,110,true,"Large-scale phosphorylation discovery",44,23111157,XCorr,3.1210000,,,,,,
KMTVDDLIAR,ph,T,110,true,"atm and atr DNA damage response",88,25561503,"MASCOT Score",60.0000000,1.0000000,,,,,0.5800000
KMTVDDLIAR,ph,T,110,true,"TOR Kinase and ABA Receptor",100,29290610,XCorr,3.3759847,1.0000000,,,,9.2999998742016E-6,
KMTVDDLIAR,ph,T,110,true,"Tissue atlas Arabidopsis - ProteomicsDB",114,32188942,"MaxQuant score",127.3000000,1.0000000,,,,0.00015458700363524,
QETSHCDSVSFDR,sno,C,129,true,"Site-specific nitrosomeproteomic id - gsnor1-3",90a,25699590,XCorr,2.0836167,,,,,0.0010920000495389,-4.0189140
QETSHCDSVSFDR,sno,C,129,true,"Site-specific nitrosomeproteomic id - gsnor1-3",90b,25699590,XCorr,2.2400000,,,,,0.25400000810623,-5.5200000
QETSHCDSVSFDR,so,C,129,true,"Arabidopsis S-sulfenylation chemoproteomics",108,31578252,"pFind PSM Score",0.0807678,,1.0752700,,,,-1.2409735
DSVSFDR,nt,D,130,false,"Arg/N-end rule seed, prt6 vs. Wt",99,29168982,"MASCOT Score",44.6100000,,-0.6390334,0.0013226,NO,0.14939999580383,-0.3706069
