Peptide,PTM,ModifiedAA,ModifiedPosition,PeptideUniqueToGene,ExperimentDesc,ExpID,PubmedID,ScoreType,IdentScore,LocProb,Log2FChange,PQ-val,QuantSig,PEP,MassErrorPPM
QTSYSFER,ph,S,18,true,"srk2dei ABA signaling phopshoproteomics",83,23572148,"MASCOT Score",28.0000000,,,,,,0.0000000
QTSYSFER,ph,S,18,true,"atm and atr DNA damage response",88,25561503,"MASCOT Score",33.0000000,0.9600000,,,,,-0.3800000
QTSYSFER,ph,S,18,true,"Phospho cell culture sucrose/TOR",109,30833711,,,0.9655570,,,,,
QTSYSFER,ph,S,18,true,"Tissue atlas Arabidopsis - ProteomicsDB",114,32188942,"MaxQuant score",128.8700000,0.9994790,,,,0.0029501700773835,
QTSYSFER,ph,S,20,true,"atm and atr DNA damage response",88,25561503,"MASCOT Score",23.0000000,0.9940000,,,,,0.5000000
QTSYSFER,ph,S,20,true,"Phospho cell culture sucrose/TOR",109,30833711,,,0.9897540,,,,,
QTSYSFER,ph,S,20,true,"Tissue atlas Arabidopsis - ProteomicsDB",114,32188942,"MaxQuant score",119.5300000,0.9999380,,,,0.002975309966132,
DLGLTLAADALNAGYNSDEEVYAAAK,ph,Y,138,true,"Brassinosteroid-Regulated Phosphorylation Dynamics",94,26187819,"MaxQuant Score",149.0000000,0.7920000,,,,8.0510000138544E-24,0.2430000
KDLGLTLAADALNAGYNSDEEVYAAAK,ph,S,140,true,"Arabidopsis root NAA phosphoproteome",18a,27643528,"MaxQuant Score",70.2170000,0.7540000,,,,3.7250001128086E-7,0.0330000
KDLGLTLAADALNAGYNSDEEVYAAAK,ph,S,140,true,"Large-scale phosphorylation discovery",44,23111157,XCorr,7.3670000,,,,,,
KDLGLTLAADALNAGYNSDEEVYAAAK,ph,S,140,true,"SnRK2 protein kinase substrates",85,23776212,XCorr,4.7924814,0.9930000,,,,3.96250006599E-16,
KDLGLTLAADALNAGYNSDEEVYAAAK,ph,S,140,true,"Phospho cell culture sucrose/TOR",109,30833711,,,0.9996220,,,,,
KDLGLTLAADALNAGYNSDEEVYAAAK,ph,S,140,true,"Col-0 callus - FC Col-0 vs. Col-0 Xray",111a,31410901,,100.6200000,,0.4317689,0.0000000,NO,,0.8525074
KDLGLTLAADALNAGYNSDEEVYAAAK,ph,S,140,true,"Col-0 X-ray callus - FC Col-0 vs. Col-0 Xray",111b,31410901,,100.6200000,,0.4317689,0.0000000,NO,,0.8525074
KDLGLTLAADALNAGYNSDEEVYAAAK,ph,S,140,true,"atm callus - FC atm vs. atm Xray",111c,31410901,,100.6200000,,0.7652729,0.0000000,NO,,0.8525074
KDLGLTLAADALNAGYNSDEEVYAAAK,ph,S,140,true,"atm-3 X-ray callus - FC atm vs. atm Xray",111d,31410901,,100.6200000,,0.7652729,0.0000000,NO,,0.8525074
KDLGLTLAADALNAGYNSDEEVYAAAK,ph,S,140,true,"Tissue atlas Arabidopsis - ProteomicsDB",114,32188942,"MaxQuant score",176.5000000,0.9999890,,,,0,
DLGLTLAADALNAGYNSDEEVYAAAK,ph,S,140,true,"srk2dei ABA signaling phopshoproteomics",83,23572148,"MASCOT Score",81.0000000,,,,,,-0.0013000
DLGLTLAADALNAGYNSDEEVYAAAK,ph,S,140,true,"SnRK2 protein kinase substrates",85,23776212,XCorr,5.6307054,1.0000000,,,,0.00031137000769377,
DLGLTLAADALNAGYNSDEEVYAAAK,ph,S,140,true,"Brassinosteroid-Regulated Phosphorylation Dynamics",94,26187819,"MaxQuant Score",181.8300000,0.9980000,,,,2.8053995255783E-42,1.1860000
DLGLTLAADALNAGYNSDEEVYAAAK,ph,S,140,true,"TOR Kinase and ABA Receptor",100,29290610,XCorr,5.7399755,0.9808000,,,,4.8850001821421E-10,
DLGLTLAADALNAGYNSDEEVYAAAK,ph,S,140,true,"Lateral root-induction - NAA vs control",106,23328941,"MASCOT Score",53.0000000,,,,,,
DLGLTLAADALNAGYNSDEEVYAAAK,ph,Y,145,true,"srk2dei ABA signaling phopshoproteomics",83,23572148,"MASCOT Score",31.0000000,,,,,,-0.0030000
AVDAGMLDYDSDDNPIVVDKR,ph,Y,158,true,"Large-scale phosphorylation discovery",44,23111157,XCorr,4.6140000,,,,,,
AVDAGMLDYDSDDNPIVVDKR,ph,Y,158,true,"Col-0 callus - FC Col-0 vs. Col-0 Xray",111a,31410901,,38.3500000,,1.2986013,0.0000000,NO,,0.2289749
AVDAGMLDYDSDDNPIVVDKR,ph,Y,158,true,"Col-0 X-ray callus - FC Col-0 vs. Col-0 Xray",111b,31410901,,38.3500000,,1.2986013,0.0000000,NO,,0.2289749
AVDAGMLDYDSDDNPIVVDKR,ph,Y,158,true,"atm callus - FC atm vs. atm Xray",111c,31410901,,38.3500000,,0.9573991,0.0000000,NO,,0.2289749
AVDAGMLDYDSDDNPIVVDKR,ph,Y,158,true,"atm-3 X-ray callus - FC atm vs. atm Xray",111d,31410901,,38.3500000,,0.9573991,0.0000000,NO,,0.2289749
AVDAGMLDYDSDDNPIVVDK,ph,Y,158,true,"srk2dei ABA signaling phopshoproteomics",83,23572148,"MASCOT Score",32.0000000,,,,,,0.0018000
AVDAGMLDYDSDDNPIVVDK,ph,Y,158,true,"Brassinosteroid-Regulated Phosphorylation Dynamics",94,26187819,"MaxQuant Score",62.7650000,0.8740000,,,,0.023000000044703,-3.6120000
AVDAGMLDYDSDDNPIVVDKRK,ph,S,160,true,"Chloroplast kinase substrates",60,19376835,"MASCOT Score",86.5500000,,,,,,-1.2733700
AVDAGMLDYDSDDNPIVVDKR,ph,S,160,true,"Phosphorylation nuclei-enriched fractions",28,19245862,,,,,,,,
AVDAGMLDYDSDDNPIVVDKR,ph,S,160,true,"Mitochondrial phosphoproteome",32,19688752,"MASCOT Score",71.9600000,,,,,,-7.0779500
AVDAGMLDYDSDDNPIVVDKR,ph,S,160,true,"Phosphoproteome ethylene-regulated time response",46,24043427,"MASCOT Score",51.1500000,,,,,,-14.8006000
AVDAGMLDYDSDDNPIVVDKR,ph,S,160,true,"PAMP-triggered phosphorylation",48,24601666,"MASCOT Score",44.7200000,,,,,,
AVDAGMLDYDSDDNPIVVDKR,ph,S,160,true,"Tyrosine phosphorylation in Arabidopsis",59,18463617,"MASCOT Score",24.0000000,,,,,,-1.6757218
AVDAGMLDYDSDDNPIVVDKR,ph,S,160,true,"Chloroplast kinase substrates",60,19376835,"MASCOT Score",84.6700000,,,,,,-0.7937960
AVDAGMLDYDSDDNPIVVDKR,ph,S,160,true,"LAXIC - ABA stress",84a,23660473,XCorr,3.9600000,0.8820000,,,,0.0022641899995506,
AVDAGMLDYDSDDNPIVVDKR,ph,S,160,true,"SnRK2 protein kinase substrates",85,23776212,XCorr,4.1199455,0.9990000,,,,0.0030294700991362,
AVDAGMLDYDSDDNPIVVDKR,ph,S,160,true,"atm and atr DNA damage response",88,25561503,"MASCOT Score",60.0000000,1.0000000,,,,,-0.7000000
AVDAGMLDYDSDDNPIVVDKR,ph,S,160,true,"Col-0 callus - FC Col-0 vs. Col-0 Xray",111a,31410901,,96.7400000,,1.4687239,0.0000000,NO,,1.0934030
AVDAGMLDYDSDDNPIVVDKR,ph,S,160,true,"Col-0 X-ray callus - FC Col-0 vs. Col-0 Xray",111b,31410901,,96.7400000,,1.4687239,0.0000000,NO,,1.0934030
AVDAGMLDYDSDDNPIVVDKR,ph,S,160,true,"atm callus - FC atm vs. atm Xray",111c,31410901,,96.7400000,,2.9973748,0.0000000,NO,,1.0934030
AVDAGMLDYDSDDNPIVVDKR,ph,S,160,true,"atm-3 X-ray callus - FC atm vs. atm Xray",111d,31410901,,96.7400000,,2.9973748,0.0000000,NO,,1.0934030
AVDAGMLDYDSDDNPIVVDKR,ph,S,160,true,"Tissue atlas Arabidopsis - ProteomicsDB",114,32188942,"MaxQuant score",402.3600000,1.0000000,,,,0,
AVDAGMLDYDSDDNPIVVDKR,ph,S,160,true,"Touch-induced phosphorylation: 40s touch vs untouc",136,30291188,"MASCOT score",124.0000000,,-0.1292161,0.7084524,NO,,-0.0177196
AVDAGMLDYDSDDNPIVVDK,ph,S,160,true,"Arabidopsis root NAA phosphoproteome",18a,27643528,"MaxQuant Score",97.5420000,1.0000000,,,,7.1849999908058E-12,-1.3910000
AVDAGMLDYDSDDNPIVVDK,ph,S,160,true,"Phosphorylation nuclei-enriched fractions",28,19245862,,,,,,,,
AVDAGMLDYDSDDNPIVVDK,ph,S,160,true,"Tyrosine phosphorylation in Arabidopsis",59,18463617,"MASCOT Score",98.0000000,,,,,,-0.9413106
AVDAGMLDYDSDDNPIVVDK,ph,S,160,true,"Chloroplast kinase substrates",60,19376835,"MASCOT Score",71.1900000,,,,,,-1.1638300
AVDAGMLDYDSDDNPIVVDK,ph,S,160,true,"srk2dei ABA signaling phopshoproteomics",83,23572148,"MASCOT Score",72.0000000,,,,,,-0.0022000
AVDAGMLDYDSDDNPIVVDK,ph,S,160,true,"LAXIC - ABA stress",84a,23660473,XCorr,5.2300000,1.0000000,,,,6.7399997760731E-7,
AVDAGMLDYDSDDNPIVVDK,ph,S,160,true,"LAXIC - mannitol vs control",84b,23660473,XCorr,3.9500000,1.0000000,,,,3.6800000088988E-5,
AVDAGMLDYDSDDNPIVVDK,ph,S,160,true,"SnRK2 protein kinase substrates",85,23776212,XCorr,3.8705153,1.0000000,,,,3.0166500807755E-12,
AVDAGMLDYDSDDNPIVVDK,ph,S,160,true,"atm and atr DNA damage response",88,25561503,"MASCOT Score",43.0000000,1.0000000,,,,,-0.0700000
AVDAGMLDYDSDDNPIVVDK,ph,S,160,true,"Brassinosteroid-Regulated Phosphorylation Dynamics",94,26187819,"MaxQuant Score",223.1800000,1.0000000,,,,0,1.3960000
AVDAGMLDYDSDDNPIVVDK,ph,S,160,true,"TOR Kinase and ABA Receptor",100,29290610,XCorr,6.4092855,1.0000000,,,,5.1350002649997E-7,
AVDAGMLDYDSDDNPIVVDK,ph,S,160,true,"Lateral root-induction - NAA vs control",106,23328941,"MASCOT Score",65.0000000,,,,,,
AVDAGMLDYDSDDNPIVVDK,ph,S,160,true,"Phospho cell culture sucrose/TOR",109,30833711,,,1.0000000,,,,,
TFEDCGFSSQIMSAIKK,ph,S,241,true,"Tissue atlas Arabidopsis - ProteomicsDB",114,32188942,"MaxQuant score",111.5300000,0.9998810,,,,1.3155300182532E-9,
QAYEKPTAIQCQALPIVLSGR,so,C,256,true,"Arabidopsis S-sulfenylation chemoproteomics",108,31578252,"pFind PSM Score",0.2138050,,1.8518500,,,,-0.9347882
AGCEIVVATPGR,so,C,352,true,"S-sulfenylation site detection using YAP1C",110,32714340,,,,,,,,
NSFVAATPSNPQNQAYPNK,ph,S,682,true,"Tissue atlas Arabidopsis - ProteomicsDB",114,32188942,"MaxQuant score",102.5500000,0.9999890,,,,3.024319994438E-7,
