Peptide,PTM,ModifiedAA,ModifiedPosition,PeptideUniqueToGene,ExperimentDesc,ExpID,PubmedID,ScoreType,IdentScore,LocProb,Log2FChange,PQ-val,QuantSig,PEP,MassErrorPPM
ASESGLNGDPNILEEVSETK,nta,A,2,true,"Characterization plant N-terminal acetylation",6,22223895,"MASCOT Score",37.3400000,,,,,,
ASESGLNGDPNILEEVSETKR,ph,S,3,true,"Tissue atlas Arabidopsis - ProteomicsDB",114,32188942,"MaxQuant score",277.2700000,0.9994280,,,,0,
ASESGLNGDPNILEEVSETKR,ph,S,18,true,"Tissue atlas Arabidopsis - ProteomicsDB",114,32188942,"MaxQuant score",287.1400000,0.9605500,,,,0,
TVASFTGEKQAISNYNK,ub,K,263,false,"Ubiquitination Membrane Proteins",120,33585938,,,,,,,,
STVVSLIER,ph,T,427,false,"Lateral root-induction - NAA vs control",106,23328941,"MASCOT Score",21.0000000,,,,,,
AAAELANASK,ph,S,502,true,"Lateral root-induction - NAA vs control",106,23328941,"MASCOT Score",20.0000000,,,,,,
TTVVVAHRLSTVR,ph,S,582,false,"Tissue atlas Arabidopsis - ProteomicsDB",114,32188942,"MaxQuant score",124.9100000,0.8735930,,,,1.7076899894164E-5,
LQEEKKSDENAAEEQK,ph,S,627,true,"Tissue atlas Arabidopsis - ProteomicsDB",114,32188942,"MaxQuant score",87.7930000,1.0000000,,,,5.7212499086745E-5,
KSDENAAEEQKMSSIESFK,ph,S,638,true,"Tissue atlas Arabidopsis - ProteomicsDB",114,32188942,"MaxQuant score",101.0400000,1.0000000,,,,7.4607204095245E-12,
KSDENAAEEQKMSSIESFK,ph,S,639,true,"Tissue atlas Arabidopsis - ProteomicsDB",114,32188942,"MaxQuant score",152.1100000,1.0000000,,,,7.4607204095245E-12,
MSSIESFK,ph,S,639,true,"Phytohormone-responsive phosphoproteins",34,20374526,"MASCOT Score",63.0000000,,,,,,
MSSIESFK,ph,S,639,true,"Lateral root-induction - NAA vs control",106,23328941,"MASCOT Score",20.0000000,,,,,,
MSSIESFKQSSLRK,ph,S,642,true,"Arabidopsis root NAA phosphoproteome",18a,27643528,"MaxQuant Score",74.6180000,0.9880000,,,,2.0049999704952E-7,-1.1670000
MSSIESFKQSSLRK,ph,S,642,true,"Brassinosteroid-Regulated Phosphorylation Dynamics",94,26187819,"MaxQuant Score",118.9600000,0.9990000,,,,0.0049999998882413,2.6120000
MSSIESFKQSSLR,ph,S,642,true,"Plasmamembrane phosphorylation",20,15308754,,,,,,,,
MSSIESFKQSSLR,ph,S,642,true,"Plasmembrane Ph Immune Responses",25,17651370,,,,,,,,
MSSIESFKQSSLR,ph,S,642,true,"Tissue atlas Arabidopsis - ProteomicsDB",114,32188942,"MaxQuant score",263.0400000,1.0000000,,,,0,
MSSIESFK,ph,S,642,true,"Arabidopsis root NAA phosphoproteome",18a,27643528,"MaxQuant Score",74.6180000,0.9970000,,,,2.0049999704952E-7,0.3320000
MSSIESFK,ph,S,642,true,"Plasmamembrane phosphorylation",20,15308754,,,,,,,,
MSSIESFK,ph,S,642,true,"Plasmembrane Ph Immune Responses",25,17651370,,,,,,,,
MSSIESFK,ph,S,642,true,"atm and atr DNA damage response",88,25561503,"MASCOT Score",42.0000000,1.0000000,,,,,-2.2800000
MSSIESFK,ph,S,642,true,"TOR Kinase and ABA Receptor",100,29290610,XCorr,2.8745649,1.0000000,,,,0.0020580000709742,
MSSIESFK,ph,S,642,true,"Phospho cell culture sucrose/TOR",109,30833711,,,0.9999060,,,,,
MSSIESFK,ph,S,642,true,"Col-0 callus - FC Col-0 vs. Col-0 Xray",111a,31410901,,21.0600000,,1.5653965,0.0000000,NO,,0.0452111
MSSIESFK,ph,S,642,true,"Col-0 X-ray callus - FC Col-0 vs. Col-0 Xray",111b,31410901,,21.0600000,,1.5653965,0.0000000,NO,,0.0452111
MSSIESFK,ph,S,642,true,"atm callus - FC atm vs. atm Xray",111c,31410901,,21.0600000,,0.4598695,0.0000000,NO,,0.0452111
MSSIESFK,ph,S,642,true,"atm-3 X-ray callus - FC atm vs. atm Xray",111d,31410901,,21.0600000,,0.4598695,0.0000000,NO,,0.0452111
MSSIESFKQSSLR,ph,S,646,true,"Tissue atlas Arabidopsis - ProteomicsDB",114,32188942,"MaxQuant score",126.0400000,0.9549750,,,,1.7074700735975E-5,
MSSIESFKQSSLRK,ph,S,647,true,"Arabidopsis root NAA phosphoproteome",18a,27643528,"MaxQuant Score",74.6180000,0.9190000,,,,2.0049999704952E-7,-1.1670000
MSSIESFKQSSLRK,ph,S,647,true,"Brassinosteroid-Regulated Phosphorylation Dynamics",94,26187819,"MaxQuant Score",118.9600000,0.9990000,,,,0.0049999998882413,1.8830000
MSSIESFKQSSLRK,ph,S,647,true,"Phospho cell culture sucrose/TOR",109,30833711,,,0.8995380,,,,,
MSSIESFKQSSLRK,ph,S,647,true,"Tissue atlas Arabidopsis - ProteomicsDB",114,32188942,"MaxQuant score",263.0400000,0.9823890,,,,0,
SLSKGGSSR,ph,S,658,true,"atm and atr DNA damage response",88,25561503,"MASCOT Score",26.0000000,0.9980000,,,,,-1.0300000
GNSSRHSFNMFGFPAGIDGNVVQDQEEDDTTQPK,ph,S,668,true,"Tissue atlas Arabidopsis - ProteomicsDB",114,32188942,"MaxQuant score",130.8700000,0.7718750,,,,0,
HSFNMFGFPAGIDGNVVQDQEEDDTTQPK,ph,S,671,true,"Plasmamembrane phosphorylation",20,15308754,,,,,,,,
HSFNMFGFPAGIDGNVVQDQEEDDTTQPK,ph,S,671,true,"Phosphorylation Early Elicitor Signaling",23,17317660,,,,,,,,
HSFNMFGFPAGIDGNVVQDQEEDDTTQPK,ph,S,671,true,"Tissue atlas Arabidopsis - ProteomicsDB",114,32188942,"MaxQuant score",177.7700000,1.0000000,,,,0,
SMCFEK,sno,C,799,false,"hot5-4 / wildtype, FAT-switch S-nitrosoproteome",169,37277371,,,,,,,,
TVASFCAEDK,sno,C,918,false,"hot5-4 / wildtype, FAT-switch S-nitrosoproteome",169,37277371,,,,1.5247056,0.0013491,YES,,
IDPSVESGR,ph,S,1031,true,"Tissue atlas Arabidopsis - ProteomicsDB",114,32188942,"MaxQuant score",69.8150000,0.9463870,,,,0.010044899769127,
VLDNVKGDIELR,ub,K,1039,false,"Ubiquitination Membrane Proteins",120,33585938,,,,,,,,
FYDPDSGEITLDGVEIK,ph,Y,1094,true,"SIRK1 phosphorylation",86a,23820729,"MaxQuant Score",77.9940000,0.9800000,,,,1.0310000181198,2.5630000
FYDPDSGEITLDGVEIK,ph,Y,1094,true,"SIRK1 exp - sirk1 mutant vs WT",86b,23820729,,,,1.3003115,,NO,,
FYDPDSGEITLDGVEIK,ph,Y,1094,true,"SIRK1 exp - 35S:SIRK1 vs WT",86c,23820729,,,,-0.7787649,,NO,,
GIQLSGGQKQR,ac,K,1187,false,"Quantitative Acetylproteomics",101,29440448,,,,,,,,
LSTIKNADVIAVVK,ub,K,1244,false,"Ubiquitination Membrane Proteins",120,33585938,,,,,,,,
